<?xml version="1.0" encoding="utf-8" standalone="no"?>
<!DOCTYPE svg PUBLIC "-//W3C//DTD SVG 1.1//EN"
  "http://www.w3.org/Graphics/SVG/1.1/DTD/svg11.dtd">
<svg xmlns:xlink="http://www.w3.org/1999/xlink" width="460.8pt" height="345.6pt" viewBox="0 0 460.8 345.6" xmlns="http://www.w3.org/2000/svg" version="1.1">
 <metadata>
  <rdf:RDF xmlns:dc="http://purl.org/dc/elements/1.1/" xmlns:cc="http://creativecommons.org/ns#" xmlns:rdf="http://www.w3.org/1999/02/22-rdf-syntax-ns#">
   <cc:Work>
    <dc:type rdf:resource="http://purl.org/dc/dcmitype/StillImage"/>
    <dc:date>2024-06-19T23:10:31.545830</dc:date>
    <dc:format>image/svg+xml</dc:format>
    <dc:creator>
     <cc:Agent>
      <dc:title>Matplotlib v3.6.3, https://matplotlib.org/</dc:title>
     </cc:Agent>
    </dc:creator>
   </cc:Work>
  </rdf:RDF>
 </metadata>
 <defs>
  <style type="text/css">*{stroke-linejoin: round; stroke-linecap: butt}</style>
 </defs>
 <g id="figure_1">
  <g id="patch_1">
   <path d="M 0 345.6 
L 460.8 345.6 
L 460.8 0 
L 0 0 
z
" style="fill: #ffffff"/>
  </g>
  <g id="axes_1">
   <g id="patch_2">
    <path d="M 57.6 307.584 
L 343.296 307.584 
L 343.296 41.472 
L 57.6 41.472 
z
" style="fill: #ffffff"/>
   </g>
   <g id="PathCollection_1">
    <path d="M 343.296 253.656383 
L 343.296 254.3616 
L 342.055321 254.3616 
z
" clip-path="url(#pb31b5dd81e)" style="fill: #440154"/>
   </g>
   <g id="PathCollection_2">
    <path d="M 343.296 252.774004 
L 343.296 253.656383 
L 342.055321 254.3616 
L 340.502962 254.3616 
z
" clip-path="url(#pb31b5dd81e)" style="fill: #440154"/>
   </g>
   <g id="PathCollection_3">
    <path d="M 343.296 251.891625 
L 343.296 252.774004 
L 340.502962 254.3616 
L 338.950603 254.3616 
z
" clip-path="url(#pb31b5dd81e)" style="fill: #440154"/>
   </g>
   <g id="PathCollection_4">
    <path d="M 343.296 251.009246 
L 343.296 251.891625 
L 338.950603 254.3616 
L 337.398245 254.3616 
z
" clip-path="url(#pb31b5dd81e)" style="fill: #440154"/>
   </g>
   <g id="PathCollection_5">
    <path d="M 343.296 250.126866 
L 343.296 251.009246 
L 337.398245 254.3616 
L 335.845886 254.3616 
z
" clip-path="url(#pb31b5dd81e)" style="fill: #440154"/>
   </g>
   <g id="PathCollection_6">
    <path d="M 293.609739 263.199031 
L 293.65978 263.196265 
L 293.609739 263.232 
L 293.552781 263.232 
z
" clip-path="url(#pb31b5dd81e)" style="fill: #440154"/>
    <path d="M 343.296 249.244487 
L 343.296 250.126866 
L 335.845886 254.3616 
L 334.293527 254.3616 
z
" clip-path="url(#pb31b5dd81e)" style="fill: #440154"/>
   </g>
   <g id="PathCollection_7">
    <path d="M 293.609739 261.536315 
L 296.183506 261.39404 
L 293.65978 263.196265 
L 293.609739 263.199031 
L 293.552781 263.232 
L 290.680225 263.232 
z
" clip-path="url(#pb31b5dd81e)" style="fill: #440154"/>
    <path d="M 343.296 248.362108 
L 343.296 249.244487 
L 334.293527 254.3616 
L 332.741169 254.3616 
z
" clip-path="url(#pb31b5dd81e)" style="fill: #440154"/>
   </g>
   <g id="PathCollection_8">
    <path d="M 293.609739 259.873598 
L 298.707231 259.591815 
L 296.183506 261.39404 
L 293.609739 261.536315 
L 290.680225 263.232 
L 287.80767 263.232 
z
" clip-path="url(#pb31b5dd81e)" style="fill: #440154"/>
    <path d="M 330.275137 50.3424 
L 318.643868 41.472 
L 330.874435 41.472 
L 343.296 41.472 
L 343.296 50.3424 
L 343.296 59.2128 
L 343.296 60.945454 
L 341.032926 59.2128 
L 330.874435 50.763306 
z
" clip-path="url(#pb31b5dd81e)" style="fill: #440154"/>
    <path d="M 343.296 247.479729 
L 343.296 248.362108 
L 332.741169 254.3616 
L 331.18881 254.3616 
z
" clip-path="url(#pb31b5dd81e)" style="fill: #440154"/>
   </g>
   <g id="PathCollection_9">
    <path d="M 57.6 147.9168 
L 57.6 139.0464 
L 57.6 130.176 
L 57.6 121.3056 
L 57.6 112.4352 
L 57.6 103.5648 
L 57.6 94.6944 
L 57.6 85.824 
L 57.6 76.9536 
L 57.6 68.0832 
L 57.6 59.2128 
L 57.6 50.3424 
L 57.6 41.472 
L 70.021565 41.472 
L 82.44313 41.472 
L 94.864696 41.472 
L 107.286261 41.472 
L 119.707826 41.472 
L 132.129391 41.472 
L 144.550957 41.472 
L 156.972522 41.472 
L 169.394087 41.472 
L 181.815652 41.472 
L 194.237217 41.472 
L 206.658783 41.472 
L 219.080348 41.472 
L 231.501913 41.472 
L 243.923478 41.472 
L 256.345043 41.472 
L 268.766609 41.472 
L 281.188174 41.472 
L 293.609739 41.472 
L 306.031304 41.472 
L 318.45287 41.472 
L 318.643868 41.472 
L 330.275137 50.3424 
L 330.874435 50.763306 
L 341.032926 59.2128 
L 343.296 60.945454 
L 343.296 68.0832 
L 343.296 76.9536 
L 343.296 85.824 
L 343.296 94.6944 
L 343.296 103.5648 
L 343.296 112.4352 
L 343.296 121.3056 
L 343.296 130.176 
L 343.296 139.0464 
L 343.296 140.365069 
L 339.389591 139.0464 
L 330.874435 135.939086 
L 318.45287 132.390892 
L 308.767571 130.176 
L 306.031304 129.494711 
L 293.609739 126.909303 
L 281.188174 125.04063 
L 268.766609 122.891118 
L 256.345043 121.457272 
L 254.589556 121.3056 
L 243.923478 120.287451 
L 231.501913 120.34854 
L 219.080348 119.928373 
L 206.658783 120.369628 
L 194.237217 120.892105 
L 191.285758 121.3056 
L 181.815652 122.597434 
L 169.394087 123.912127 
L 156.972522 126.618547 
L 144.550957 129.050596 
L 139.981048 130.176 
L 132.129391 132.06649 
L 119.707826 135.04048 
L 107.286261 138.418327 
L 104.989817 139.0464 
L 94.864696 141.765363 
L 82.44313 144.801969 
L 70.021565 147.246599 
L 62.881302 147.9168 
L 57.6 148.407999 
z
" clip-path="url(#pb31b5dd81e)" style="fill: #482475"/>
    <path d="M 293.609739 258.210881 
L 301.230957 257.78959 
L 298.707231 259.591815 
L 293.609739 259.873598 
L 287.80767 263.232 
L 284.935114 263.232 
z
" clip-path="url(#pb31b5dd81e)" style="fill: #482475"/>
    <path d="M 330.874435 251.591876 
L 343.296 246.59735 
L 343.296 247.479729 
L 331.18881 254.3616 
L 330.874435 254.3616 
L 325.654181 254.3616 
z
" clip-path="url(#pb31b5dd81e)" style="fill: #482475"/>
   </g>
   <g id="PathCollection_10">
    <path d="M 57.6 236.6208 
L 57.6 227.7504 
L 57.6 218.88 
L 57.6 210.0096 
L 57.6 201.1392 
L 57.6 192.2688 
L 57.6 183.3984 
L 57.6 174.528 
L 57.6 165.6576 
L 57.6 156.7872 
L 57.6 148.407999 
L 62.881302 147.9168 
L 70.021565 147.246599 
L 82.44313 144.801969 
L 94.864696 141.765363 
L 104.989817 139.0464 
L 107.286261 138.418327 
L 119.707826 135.04048 
L 132.129391 132.06649 
L 139.981048 130.176 
L 144.550957 129.050596 
L 156.972522 126.618547 
L 169.394087 123.912127 
L 181.815652 122.597434 
L 191.285758 121.3056 
L 194.237217 120.892105 
L 206.658783 120.369628 
L 219.080348 119.928373 
L 231.501913 120.34854 
L 243.923478 120.287451 
L 254.589556 121.3056 
L 256.345043 121.457272 
L 268.766609 122.891118 
L 281.188174 125.04063 
L 293.609739 126.909303 
L 306.031304 129.494711 
L 308.767571 130.176 
L 318.45287 132.390892 
L 330.874435 135.939086 
L 339.389591 139.0464 
L 343.296 140.365069 
L 343.296 147.9168 
L 343.296 156.7872 
L 343.296 165.6576 
L 343.296 174.528 
L 343.296 183.3984 
L 343.296 192.2688 
L 343.296 193.994067 
L 335.468962 192.2688 
L 330.874435 191.228488 
L 318.45287 189.362459 
L 306.031304 188.188489 
L 293.609739 187.494978 
L 281.188174 187.381584 
L 268.766609 187.333306 
L 256.345043 187.832425 
L 243.923478 188.683498 
L 231.501913 190.26073 
L 219.080348 191.84448 
L 216.576437 192.2688 
L 206.658783 193.848385 
L 194.237217 196.057941 
L 181.815652 198.935086 
L 172.609481 201.1392 
L 169.394087 201.860185 
L 156.972522 205.241306 
L 144.550957 208.814787 
L 140.800621 210.0096 
L 132.129391 212.582995 
L 119.707826 216.538059 
L 112.91323 218.88 
L 107.286261 220.677975 
L 94.864696 224.879355 
L 86.755627 227.7504 
L 82.44313 229.158381 
L 70.021565 233.276243 
L 59.921917 236.6208 
L 57.6 237.326423 
z
" clip-path="url(#pb31b5dd81e)" style="fill: #355f8d"/>
    <path d="M 293.609739 256.548164 
L 303.754682 255.987365 
L 301.230957 257.78959 
L 293.609739 258.210881 
L 284.935114 263.232 
L 282.062558 263.232 
z
" clip-path="url(#pb31b5dd81e)" style="fill: #355f8d"/>
    <path d="M 330.874435 248.118804 
L 343.296 245.71497 
L 343.296 246.59735 
L 330.874435 251.591876 
L 325.654181 254.3616 
L 319.108288 254.3616 
z
" clip-path="url(#pb31b5dd81e)" style="fill: #355f8d"/>
   </g>
   <g id="PathCollection_11">
    <path d="M 57.6 272.1024 
L 57.6 263.232 
L 57.6 254.3616 
L 57.6 245.4912 
L 57.6 237.326423 
L 59.921917 236.6208 
L 70.021565 233.276243 
L 82.44313 229.158381 
L 86.755627 227.7504 
L 94.864696 224.879355 
L 107.286261 220.677975 
L 112.91323 218.88 
L 119.707826 216.538059 
L 132.129391 212.582995 
L 140.800621 210.0096 
L 144.550957 208.814787 
L 156.972522 205.241306 
L 169.394087 201.860185 
L 172.609481 201.1392 
L 181.815652 198.935086 
L 194.237217 196.057941 
L 206.658783 193.848385 
L 216.576437 192.2688 
L 219.080348 191.84448 
L 231.501913 190.26073 
L 243.923478 188.683498 
L 256.345043 187.832425 
L 268.766609 187.333306 
L 281.188174 187.381584 
L 293.609739 187.494978 
L 306.031304 188.188489 
L 318.45287 189.362459 
L 330.874435 191.228488 
L 335.468962 192.2688 
L 343.296 193.994067 
L 343.296 201.1392 
L 343.296 210.0096 
L 343.296 218.88 
L 343.296 227.7504 
L 343.296 236.6208 
L 343.296 245.4912 
L 343.296 245.71497 
L 330.874435 248.118804 
L 319.108288 254.3616 
L 318.45287 254.3616 
L 306.031304 254.3616 
L 303.754682 255.987365 
L 293.609739 256.548164 
L 282.062558 263.232 
L 281.188174 263.232 
L 272.877331 263.232 
L 281.188174 258.236743 
L 293.609739 254.885447 
L 303.086223 254.3616 
L 306.031304 251.880674 
L 318.45287 246.06042 
L 320.964746 245.4912 
L 322.815444 236.6208 
L 318.45287 234.126253 
L 306.031304 230.799841 
L 293.609739 229.360854 
L 281.188174 228.965229 
L 268.766609 228.962299 
L 256.345043 229.523749 
L 243.923478 230.458322 
L 231.501913 231.918594 
L 219.080348 233.520354 
L 206.658783 235.537062 
L 200.726595 236.6208 
L 194.237217 237.695011 
L 181.815652 240.142774 
L 169.394087 242.776151 
L 158.396491 245.4912 
L 156.972522 245.805076 
L 144.550957 248.697482 
L 132.129391 251.913216 
L 123.402581 254.3616 
L 119.707826 255.274587 
L 107.286261 258.560488 
L 94.864696 262.135136 
L 91.241738 263.232 
L 82.44313 265.54058 
L 70.021565 269.00823 
L 59.483896 272.1024 
L 57.6 272.572338 
z
" clip-path="url(#pb31b5dd81e)" style="fill: #21918c"/>
   </g>
   <g id="PathCollection_12">
    <path d="M 57.6 289.8432 
L 57.6 280.9728 
L 57.6 272.572338 
L 59.483896 272.1024 
L 70.021565 269.00823 
L 82.44313 265.54058 
L 91.241738 263.232 
L 94.864696 262.135136 
L 107.286261 258.560488 
L 119.707826 255.274587 
L 123.402581 254.3616 
L 132.129391 251.913216 
L 144.550957 248.697482 
L 156.972522 245.805076 
L 158.396491 245.4912 
L 169.394087 242.776151 
L 181.815652 240.142774 
L 194.237217 237.695011 
L 200.726595 236.6208 
L 206.658783 235.537062 
L 219.080348 233.520354 
L 231.501913 231.918594 
L 243.923478 230.458322 
L 256.345043 229.523749 
L 268.766609 228.962299 
L 281.188174 228.965229 
L 293.609739 229.360854 
L 306.031304 230.799841 
L 318.45287 234.126253 
L 322.815444 236.6208 
L 320.964746 245.4912 
L 318.45287 246.06042 
L 306.031304 251.880674 
L 303.086223 254.3616 
L 293.609739 254.885447 
L 281.188174 258.236743 
L 272.877331 263.232 
L 268.766609 263.232 
L 256.345043 263.232 
L 243.923478 263.232 
L 231.501913 272.1024 
L 220.802883 272.1024 
L 231.501913 263.237954 
L 231.565163 263.232 
L 231.501913 263.220846 
L 219.080348 262.892562 
L 214.078427 263.232 
L 206.658783 263.832627 
L 194.237217 265.086777 
L 181.815652 266.687757 
L 169.394087 268.504908 
L 156.972522 270.695019 
L 149.817733 272.1024 
L 144.550957 273.006068 
L 132.129391 275.320919 
L 119.707826 277.840822 
L 107.286261 280.623366 
L 105.832877 280.9728 
L 94.864696 283.147609 
L 82.44313 285.79983 
L 70.021565 288.685324 
L 65.293582 289.8432 
L 57.6 291.334681 
z
" clip-path="url(#pb31b5dd81e)" style="fill: #44bf70"/>
   </g>
   <g id="PathCollection_13">
    <path d="M 65.293582 289.8432 
L 70.021565 288.685324 
L 82.44313 285.79983 
L 94.864696 283.147609 
L 105.832877 280.9728 
L 107.286261 280.623366 
L 119.707826 277.840822 
L 132.129391 275.320919 
L 144.550957 273.006068 
L 149.817733 272.1024 
L 156.972522 270.695019 
L 169.394087 268.504908 
L 181.815652 266.687757 
L 194.237217 265.086777 
L 206.658783 263.832627 
L 214.078427 263.232 
L 219.080348 262.892562 
L 231.501913 263.220846 
L 231.565163 263.232 
L 231.501913 263.237954 
L 220.802883 272.1024 
L 219.080348 272.1024 
L 206.658783 272.1024 
L 194.237217 272.1024 
L 181.815652 280.9728 
L 169.394087 280.9728 
L 156.972522 280.9728 
L 144.550957 280.9728 
L 132.129391 289.8432 
L 119.707826 289.8432 
L 107.286261 289.8432 
L 94.864696 289.8432 
L 82.44313 298.7136 
L 70.021565 298.7136 
L 57.6 298.7136 
L 57.6 291.334681 
z
" clip-path="url(#pb31b5dd81e)" style="fill: #bddf26"/>
   </g>
   <g id="matplotlib.axis_1">
    <g id="xtick_1">
     <g id="line2d_1">
      <path d="M 82.44313 307.584 
L 82.44313 41.472 
" clip-path="url(#pb31b5dd81e)" style="fill: none; stroke: #b0b0b0; stroke-width: 0.8; stroke-linecap: square"/>
     </g>
     <g id="line2d_2">
      <defs>
       <path id="md009b4012f" d="M 0 0 
L 0 3.5 
" style="stroke: #000000; stroke-width: 0.8"/>
      </defs>
      <g>
       <use xlink:href="#md009b4012f" x="82.44313" y="307.584" style="stroke: #000000; stroke-width: 0.8"/>
      </g>
     </g>
     <g id="text_1">
      <!-- 0.02 -->
      <g transform="translate(71.310318 322.182437) scale(0.1 -0.1)">
       <defs>
        <path id="DejaVuSans-30" d="M 2034 4250 
Q 1547 4250 1301 3770 
Q 1056 3291 1056 2328 
Q 1056 1369 1301 889 
Q 1547 409 2034 409 
Q 2525 409 2770 889 
Q 3016 1369 3016 2328 
Q 3016 3291 2770 3770 
Q 2525 4250 2034 4250 
z
M 2034 4750 
Q 2819 4750 3233 4129 
Q 3647 3509 3647 2328 
Q 3647 1150 3233 529 
Q 2819 -91 2034 -91 
Q 1250 -91 836 529 
Q 422 1150 422 2328 
Q 422 3509 836 4129 
Q 1250 4750 2034 4750 
z
" transform="scale(0.015625)"/>
        <path id="DejaVuSans-2e" d="M 684 794 
L 1344 794 
L 1344 0 
L 684 0 
L 684 794 
z
" transform="scale(0.015625)"/>
        <path id="DejaVuSans-32" d="M 1228 531 
L 3431 531 
L 3431 0 
L 469 0 
L 469 531 
Q 828 903 1448 1529 
Q 2069 2156 2228 2338 
Q 2531 2678 2651 2914 
Q 2772 3150 2772 3378 
Q 2772 3750 2511 3984 
Q 2250 4219 1831 4219 
Q 1534 4219 1204 4116 
Q 875 4013 500 3803 
L 500 4441 
Q 881 4594 1212 4672 
Q 1544 4750 1819 4750 
Q 2544 4750 2975 4387 
Q 3406 4025 3406 3419 
Q 3406 3131 3298 2873 
Q 3191 2616 2906 2266 
Q 2828 2175 2409 1742 
Q 1991 1309 1228 531 
z
" transform="scale(0.015625)"/>
       </defs>
       <use xlink:href="#DejaVuSans-30"/>
       <use xlink:href="#DejaVuSans-2e" x="63.623047"/>
       <use xlink:href="#DejaVuSans-30" x="95.410156"/>
       <use xlink:href="#DejaVuSans-32" x="159.033203"/>
      </g>
     </g>
    </g>
    <g id="xtick_2">
     <g id="line2d_3">
      <path d="M 132.129391 307.584 
L 132.129391 41.472 
" clip-path="url(#pb31b5dd81e)" style="fill: none; stroke: #b0b0b0; stroke-width: 0.8; stroke-linecap: square"/>
     </g>
     <g id="line2d_4">
      <g>
       <use xlink:href="#md009b4012f" x="132.129391" y="307.584" style="stroke: #000000; stroke-width: 0.8"/>
      </g>
     </g>
     <g id="text_2">
      <!-- 0.04 -->
      <g transform="translate(120.996579 322.182437) scale(0.1 -0.1)">
       <defs>
        <path id="DejaVuSans-34" d="M 2419 4116 
L 825 1625 
L 2419 1625 
L 2419 4116 
z
M 2253 4666 
L 3047 4666 
L 3047 1625 
L 3713 1625 
L 3713 1100 
L 3047 1100 
L 3047 0 
L 2419 0 
L 2419 1100 
L 313 1100 
L 313 1709 
L 2253 4666 
z
" transform="scale(0.015625)"/>
       </defs>
       <use xlink:href="#DejaVuSans-30"/>
       <use xlink:href="#DejaVuSans-2e" x="63.623047"/>
       <use xlink:href="#DejaVuSans-30" x="95.410156"/>
       <use xlink:href="#DejaVuSans-34" x="159.033203"/>
      </g>
     </g>
    </g>
    <g id="xtick_3">
     <g id="line2d_5">
      <path d="M 181.815652 307.584 
L 181.815652 41.472 
" clip-path="url(#pb31b5dd81e)" style="fill: none; stroke: #b0b0b0; stroke-width: 0.8; stroke-linecap: square"/>
     </g>
     <g id="line2d_6">
      <g>
       <use xlink:href="#md009b4012f" x="181.815652" y="307.584" style="stroke: #000000; stroke-width: 0.8"/>
      </g>
     </g>
     <g id="text_3">
      <!-- 0.06 -->
      <g transform="translate(170.68284 322.182437) scale(0.1 -0.1)">
       <defs>
        <path id="DejaVuSans-36" d="M 2113 2584 
Q 1688 2584 1439 2293 
Q 1191 2003 1191 1497 
Q 1191 994 1439 701 
Q 1688 409 2113 409 
Q 2538 409 2786 701 
Q 3034 994 3034 1497 
Q 3034 2003 2786 2293 
Q 2538 2584 2113 2584 
z
M 3366 4563 
L 3366 3988 
Q 3128 4100 2886 4159 
Q 2644 4219 2406 4219 
Q 1781 4219 1451 3797 
Q 1122 3375 1075 2522 
Q 1259 2794 1537 2939 
Q 1816 3084 2150 3084 
Q 2853 3084 3261 2657 
Q 3669 2231 3669 1497 
Q 3669 778 3244 343 
Q 2819 -91 2113 -91 
Q 1303 -91 875 529 
Q 447 1150 447 2328 
Q 447 3434 972 4092 
Q 1497 4750 2381 4750 
Q 2619 4750 2861 4703 
Q 3103 4656 3366 4563 
z
" transform="scale(0.015625)"/>
       </defs>
       <use xlink:href="#DejaVuSans-30"/>
       <use xlink:href="#DejaVuSans-2e" x="63.623047"/>
       <use xlink:href="#DejaVuSans-30" x="95.410156"/>
       <use xlink:href="#DejaVuSans-36" x="159.033203"/>
      </g>
     </g>
    </g>
    <g id="xtick_4">
     <g id="line2d_7">
      <path d="M 231.501913 307.584 
L 231.501913 41.472 
" clip-path="url(#pb31b5dd81e)" style="fill: none; stroke: #b0b0b0; stroke-width: 0.8; stroke-linecap: square"/>
     </g>
     <g id="line2d_8">
      <g>
       <use xlink:href="#md009b4012f" x="231.501913" y="307.584" style="stroke: #000000; stroke-width: 0.8"/>
      </g>
     </g>
     <g id="text_4">
      <!-- 0.08 -->
      <g transform="translate(220.369101 322.182437) scale(0.1 -0.1)">
       <defs>
        <path id="DejaVuSans-38" d="M 2034 2216 
Q 1584 2216 1326 1975 
Q 1069 1734 1069 1313 
Q 1069 891 1326 650 
Q 1584 409 2034 409 
Q 2484 409 2743 651 
Q 3003 894 3003 1313 
Q 3003 1734 2745 1975 
Q 2488 2216 2034 2216 
z
M 1403 2484 
Q 997 2584 770 2862 
Q 544 3141 544 3541 
Q 544 4100 942 4425 
Q 1341 4750 2034 4750 
Q 2731 4750 3128 4425 
Q 3525 4100 3525 3541 
Q 3525 3141 3298 2862 
Q 3072 2584 2669 2484 
Q 3125 2378 3379 2068 
Q 3634 1759 3634 1313 
Q 3634 634 3220 271 
Q 2806 -91 2034 -91 
Q 1263 -91 848 271 
Q 434 634 434 1313 
Q 434 1759 690 2068 
Q 947 2378 1403 2484 
z
M 1172 3481 
Q 1172 3119 1398 2916 
Q 1625 2713 2034 2713 
Q 2441 2713 2670 2916 
Q 2900 3119 2900 3481 
Q 2900 3844 2670 4047 
Q 2441 4250 2034 4250 
Q 1625 4250 1398 4047 
Q 1172 3844 1172 3481 
z
" transform="scale(0.015625)"/>
       </defs>
       <use xlink:href="#DejaVuSans-30"/>
       <use xlink:href="#DejaVuSans-2e" x="63.623047"/>
       <use xlink:href="#DejaVuSans-30" x="95.410156"/>
       <use xlink:href="#DejaVuSans-38" x="159.033203"/>
      </g>
     </g>
    </g>
    <g id="xtick_5">
     <g id="line2d_9">
      <path d="M 281.188174 307.584 
L 281.188174 41.472 
" clip-path="url(#pb31b5dd81e)" style="fill: none; stroke: #b0b0b0; stroke-width: 0.8; stroke-linecap: square"/>
     </g>
     <g id="line2d_10">
      <g>
       <use xlink:href="#md009b4012f" x="281.188174" y="307.584" style="stroke: #000000; stroke-width: 0.8"/>
      </g>
     </g>
     <g id="text_5">
      <!-- 0.10 -->
      <g transform="translate(270.055361 322.182437) scale(0.1 -0.1)">
       <defs>
        <path id="DejaVuSans-31" d="M 794 531 
L 1825 531 
L 1825 4091 
L 703 3866 
L 703 4441 
L 1819 4666 
L 2450 4666 
L 2450 531 
L 3481 531 
L 3481 0 
L 794 0 
L 794 531 
z
" transform="scale(0.015625)"/>
       </defs>
       <use xlink:href="#DejaVuSans-30"/>
       <use xlink:href="#DejaVuSans-2e" x="63.623047"/>
       <use xlink:href="#DejaVuSans-31" x="95.410156"/>
       <use xlink:href="#DejaVuSans-30" x="159.033203"/>
      </g>
     </g>
    </g>
    <g id="xtick_6">
     <g id="line2d_11">
      <path d="M 330.874435 307.584 
L 330.874435 41.472 
" clip-path="url(#pb31b5dd81e)" style="fill: none; stroke: #b0b0b0; stroke-width: 0.8; stroke-linecap: square"/>
     </g>
     <g id="line2d_12">
      <g>
       <use xlink:href="#md009b4012f" x="330.874435" y="307.584" style="stroke: #000000; stroke-width: 0.8"/>
      </g>
     </g>
     <g id="text_6">
      <!-- 0.12 -->
      <g transform="translate(319.741622 322.182437) scale(0.1 -0.1)">
       <use xlink:href="#DejaVuSans-30"/>
       <use xlink:href="#DejaVuSans-2e" x="63.623047"/>
       <use xlink:href="#DejaVuSans-31" x="95.410156"/>
       <use xlink:href="#DejaVuSans-32" x="159.033203"/>
      </g>
     </g>
    </g>
    <g id="text_7">
     <!-- $f^{*}$ -->
     <g transform="translate(196.398 335.860562) scale(0.1 -0.1)">
      <defs>
       <path id="DejaVuSans-Oblique-66" d="M 3059 4863 
L 2969 4384 
L 2419 4384 
Q 2106 4384 1964 4261 
Q 1822 4138 1753 3809 
L 1691 3500 
L 2638 3500 
L 2553 3053 
L 1606 3053 
L 1013 0 
L 434 0 
L 1031 3053 
L 481 3053 
L 563 3500 
L 1113 3500 
L 1159 3744 
Q 1278 4363 1576 4613 
Q 1875 4863 2516 4863 
L 3059 4863 
z
" transform="scale(0.015625)"/>
       <path id="DejaVuSans-2a" d="M 3009 3897 
L 1888 3291 
L 3009 2681 
L 2828 2375 
L 1778 3009 
L 1778 1831 
L 1422 1831 
L 1422 3009 
L 372 2375 
L 191 2681 
L 1313 3291 
L 191 3897 
L 372 4206 
L 1422 3572 
L 1422 4750 
L 1778 4750 
L 1778 3572 
L 2828 4206 
L 3009 3897 
z
" transform="scale(0.015625)"/>
      </defs>
      <use xlink:href="#DejaVuSans-Oblique-66" transform="translate(0 0.765625)"/>
      <use xlink:href="#DejaVuSans-2a" transform="translate(42.652786 39.046875) scale(0.7)"/>
     </g>
    </g>
   </g>
   <g id="matplotlib.axis_2">
    <g id="ytick_1">
     <g id="line2d_13">
      <path d="M 57.6 307.584 
L 343.296 307.584 
" clip-path="url(#pb31b5dd81e)" style="fill: none; stroke: #b0b0b0; stroke-width: 0.8; stroke-linecap: square"/>
     </g>
     <g id="line2d_14">
      <defs>
       <path id="m0c947853ae" d="M 0 0 
L -3.5 0 
" style="stroke: #000000; stroke-width: 0.8"/>
      </defs>
      <g>
       <use xlink:href="#m0c947853ae" x="57.6" y="307.584" style="stroke: #000000; stroke-width: 0.8"/>
      </g>
     </g>
     <g id="text_8">
      <!-- 0 -->
      <g transform="translate(44.2375 311.383219) scale(0.1 -0.1)">
       <use xlink:href="#DejaVuSans-30"/>
      </g>
     </g>
    </g>
    <g id="ytick_2">
     <g id="line2d_15">
      <path d="M 57.6 278.016 
L 343.296 278.016 
" clip-path="url(#pb31b5dd81e)" style="fill: none; stroke: #b0b0b0; stroke-width: 0.8; stroke-linecap: square"/>
     </g>
     <g id="line2d_16">
      <g>
       <use xlink:href="#m0c947853ae" x="57.6" y="278.016" style="stroke: #000000; stroke-width: 0.8"/>
      </g>
     </g>
     <g id="text_9">
      <!-- 10 -->
      <g transform="translate(37.875 281.815219) scale(0.1 -0.1)">
       <use xlink:href="#DejaVuSans-31"/>
       <use xlink:href="#DejaVuSans-30" x="63.623047"/>
      </g>
     </g>
    </g>
    <g id="ytick_3">
     <g id="line2d_17">
      <path d="M 57.6 248.448 
L 343.296 248.448 
" clip-path="url(#pb31b5dd81e)" style="fill: none; stroke: #b0b0b0; stroke-width: 0.8; stroke-linecap: square"/>
     </g>
     <g id="line2d_18">
      <g>
       <use xlink:href="#m0c947853ae" x="57.6" y="248.448" style="stroke: #000000; stroke-width: 0.8"/>
      </g>
     </g>
     <g id="text_10">
      <!-- 20 -->
      <g transform="translate(37.875 252.247219) scale(0.1 -0.1)">
       <use xlink:href="#DejaVuSans-32"/>
       <use xlink:href="#DejaVuSans-30" x="63.623047"/>
      </g>
     </g>
    </g>
    <g id="ytick_4">
     <g id="line2d_19">
      <path d="M 57.6 218.88 
L 343.296 218.88 
" clip-path="url(#pb31b5dd81e)" style="fill: none; stroke: #b0b0b0; stroke-width: 0.8; stroke-linecap: square"/>
     </g>
     <g id="line2d_20">
      <g>
       <use xlink:href="#m0c947853ae" x="57.6" y="218.88" style="stroke: #000000; stroke-width: 0.8"/>
      </g>
     </g>
     <g id="text_11">
      <!-- 30 -->
      <g transform="translate(37.875 222.679219) scale(0.1 -0.1)">
       <defs>
        <path id="DejaVuSans-33" d="M 2597 2516 
Q 3050 2419 3304 2112 
Q 3559 1806 3559 1356 
Q 3559 666 3084 287 
Q 2609 -91 1734 -91 
Q 1441 -91 1130 -33 
Q 819 25 488 141 
L 488 750 
Q 750 597 1062 519 
Q 1375 441 1716 441 
Q 2309 441 2620 675 
Q 2931 909 2931 1356 
Q 2931 1769 2642 2001 
Q 2353 2234 1838 2234 
L 1294 2234 
L 1294 2753 
L 1863 2753 
Q 2328 2753 2575 2939 
Q 2822 3125 2822 3475 
Q 2822 3834 2567 4026 
Q 2313 4219 1838 4219 
Q 1578 4219 1281 4162 
Q 984 4106 628 3988 
L 628 4550 
Q 988 4650 1302 4700 
Q 1616 4750 1894 4750 
Q 2613 4750 3031 4423 
Q 3450 4097 3450 3541 
Q 3450 3153 3228 2886 
Q 3006 2619 2597 2516 
z
" transform="scale(0.015625)"/>
       </defs>
       <use xlink:href="#DejaVuSans-33"/>
       <use xlink:href="#DejaVuSans-30" x="63.623047"/>
      </g>
     </g>
    </g>
    <g id="ytick_5">
     <g id="line2d_21">
      <path d="M 57.6 189.312 
L 343.296 189.312 
" clip-path="url(#pb31b5dd81e)" style="fill: none; stroke: #b0b0b0; stroke-width: 0.8; stroke-linecap: square"/>
     </g>
     <g id="line2d_22">
      <g>
       <use xlink:href="#m0c947853ae" x="57.6" y="189.312" style="stroke: #000000; stroke-width: 0.8"/>
      </g>
     </g>
     <g id="text_12">
      <!-- 40 -->
      <g transform="translate(37.875 193.111219) scale(0.1 -0.1)">
       <use xlink:href="#DejaVuSans-34"/>
       <use xlink:href="#DejaVuSans-30" x="63.623047"/>
      </g>
     </g>
    </g>
    <g id="ytick_6">
     <g id="line2d_23">
      <path d="M 57.6 159.744 
L 343.296 159.744 
" clip-path="url(#pb31b5dd81e)" style="fill: none; stroke: #b0b0b0; stroke-width: 0.8; stroke-linecap: square"/>
     </g>
     <g id="line2d_24">
      <g>
       <use xlink:href="#m0c947853ae" x="57.6" y="159.744" style="stroke: #000000; stroke-width: 0.8"/>
      </g>
     </g>
     <g id="text_13">
      <!-- 50 -->
      <g transform="translate(37.875 163.543219) scale(0.1 -0.1)">
       <defs>
        <path id="DejaVuSans-35" d="M 691 4666 
L 3169 4666 
L 3169 4134 
L 1269 4134 
L 1269 2991 
Q 1406 3038 1543 3061 
Q 1681 3084 1819 3084 
Q 2600 3084 3056 2656 
Q 3513 2228 3513 1497 
Q 3513 744 3044 326 
Q 2575 -91 1722 -91 
Q 1428 -91 1123 -41 
Q 819 9 494 109 
L 494 744 
Q 775 591 1075 516 
Q 1375 441 1709 441 
Q 2250 441 2565 725 
Q 2881 1009 2881 1497 
Q 2881 1984 2565 2268 
Q 2250 2553 1709 2553 
Q 1456 2553 1204 2497 
Q 953 2441 691 2322 
L 691 4666 
z
" transform="scale(0.015625)"/>
       </defs>
       <use xlink:href="#DejaVuSans-35"/>
       <use xlink:href="#DejaVuSans-30" x="63.623047"/>
      </g>
     </g>
    </g>
    <g id="ytick_7">
     <g id="line2d_25">
      <path d="M 57.6 130.176 
L 343.296 130.176 
" clip-path="url(#pb31b5dd81e)" style="fill: none; stroke: #b0b0b0; stroke-width: 0.8; stroke-linecap: square"/>
     </g>
     <g id="line2d_26">
      <g>
       <use xlink:href="#m0c947853ae" x="57.6" y="130.176" style="stroke: #000000; stroke-width: 0.8"/>
      </g>
     </g>
     <g id="text_14">
      <!-- 60 -->
      <g transform="translate(37.875 133.975219) scale(0.1 -0.1)">
       <use xlink:href="#DejaVuSans-36"/>
       <use xlink:href="#DejaVuSans-30" x="63.623047"/>
      </g>
     </g>
    </g>
    <g id="ytick_8">
     <g id="line2d_27">
      <path d="M 57.6 100.608 
L 343.296 100.608 
" clip-path="url(#pb31b5dd81e)" style="fill: none; stroke: #b0b0b0; stroke-width: 0.8; stroke-linecap: square"/>
     </g>
     <g id="line2d_28">
      <g>
       <use xlink:href="#m0c947853ae" x="57.6" y="100.608" style="stroke: #000000; stroke-width: 0.8"/>
      </g>
     </g>
     <g id="text_15">
      <!-- 70 -->
      <g transform="translate(37.875 104.407219) scale(0.1 -0.1)">
       <defs>
        <path id="DejaVuSans-37" d="M 525 4666 
L 3525 4666 
L 3525 4397 
L 1831 0 
L 1172 0 
L 2766 4134 
L 525 4134 
L 525 4666 
z
" transform="scale(0.015625)"/>
       </defs>
       <use xlink:href="#DejaVuSans-37"/>
       <use xlink:href="#DejaVuSans-30" x="63.623047"/>
      </g>
     </g>
    </g>
    <g id="ytick_9">
     <g id="line2d_29">
      <path d="M 57.6 71.04 
L 343.296 71.04 
" clip-path="url(#pb31b5dd81e)" style="fill: none; stroke: #b0b0b0; stroke-width: 0.8; stroke-linecap: square"/>
     </g>
     <g id="line2d_30">
      <g>
       <use xlink:href="#m0c947853ae" x="57.6" y="71.04" style="stroke: #000000; stroke-width: 0.8"/>
      </g>
     </g>
     <g id="text_16">
      <!-- 80 -->
      <g transform="translate(37.875 74.839219) scale(0.1 -0.1)">
       <use xlink:href="#DejaVuSans-38"/>
       <use xlink:href="#DejaVuSans-30" x="63.623047"/>
      </g>
     </g>
    </g>
    <g id="ytick_10">
     <g id="line2d_31">
      <path d="M 57.6 41.472 
L 343.296 41.472 
" clip-path="url(#pb31b5dd81e)" style="fill: none; stroke: #b0b0b0; stroke-width: 0.8; stroke-linecap: square"/>
     </g>
     <g id="line2d_32">
      <g>
       <use xlink:href="#m0c947853ae" x="57.6" y="41.472" style="stroke: #000000; stroke-width: 0.8"/>
      </g>
     </g>
     <g id="text_17">
      <!-- 90 -->
      <g transform="translate(37.875 45.271219) scale(0.1 -0.1)">
       <defs>
        <path id="DejaVuSans-39" d="M 703 97 
L 703 672 
Q 941 559 1184 500 
Q 1428 441 1663 441 
Q 2288 441 2617 861 
Q 2947 1281 2994 2138 
Q 2813 1869 2534 1725 
Q 2256 1581 1919 1581 
Q 1219 1581 811 2004 
Q 403 2428 403 3163 
Q 403 3881 828 4315 
Q 1253 4750 1959 4750 
Q 2769 4750 3195 4129 
Q 3622 3509 3622 2328 
Q 3622 1225 3098 567 
Q 2575 -91 1691 -91 
Q 1453 -91 1209 -44 
Q 966 3 703 97 
z
M 1959 2075 
Q 2384 2075 2632 2365 
Q 2881 2656 2881 3163 
Q 2881 3666 2632 3958 
Q 2384 4250 1959 4250 
Q 1534 4250 1286 3958 
Q 1038 3666 1038 3163 
Q 1038 2656 1286 2365 
Q 1534 2075 1959 2075 
z
" transform="scale(0.015625)"/>
       </defs>
       <use xlink:href="#DejaVuSans-39"/>
       <use xlink:href="#DejaVuSans-30" x="63.623047"/>
      </g>
     </g>
    </g>
    <g id="text_18">
     <!-- $\theta_{0}$ ($^{\circ}$) -->
     <g transform="translate(31.795313 187.828) rotate(-90) scale(0.1 -0.1)">
      <defs>
       <path id="DejaVuSans-Oblique-3b8" d="M 2913 2219 
L 925 2219 
Q 791 1284 928 888 
Q 1100 400 1566 400 
Q 2034 400 2391 891 
Q 2703 1322 2913 2219 
z
M 3009 2750 
Q 3094 3638 2984 3950 
Q 2813 4444 2353 4444 
Q 1875 4444 1525 3956 
Q 1250 3563 1034 2750 
L 3009 2750 
z
M 2444 4913 
Q 3194 4913 3494 4250 
Q 3794 3591 3566 2422 
Q 3341 1256 2781 594 
Q 2225 -72 1475 -72 
Q 722 -72 425 594 
Q 128 1256 353 2422 
Q 581 3591 1134 4250 
Q 1691 4913 2444 4913 
z
" transform="scale(0.015625)"/>
       <path id="DejaVuSans-20" transform="scale(0.015625)"/>
       <path id="DejaVuSans-28" d="M 1984 4856 
Q 1566 4138 1362 3434 
Q 1159 2731 1159 2009 
Q 1159 1288 1364 580 
Q 1569 -128 1984 -844 
L 1484 -844 
Q 1016 -109 783 600 
Q 550 1309 550 2009 
Q 550 2706 781 3412 
Q 1013 4119 1484 4856 
L 1984 4856 
z
" transform="scale(0.015625)"/>
       <path id="DejaVuSans-2218" d="M 2003 2603 
Q 1753 2603 1581 2429 
Q 1409 2256 1409 2006 
Q 1409 1759 1581 1589 
Q 1753 1419 2003 1419 
Q 2253 1419 2425 1589 
Q 2597 1759 2597 2006 
Q 2597 2253 2423 2428 
Q 2250 2603 2003 2603 
z
M 2003 3006 
Q 2203 3006 2387 2929 
Q 2572 2853 2706 2709 
Q 2850 2569 2922 2390 
Q 2994 2212 2994 2006 
Q 2994 1594 2705 1308 
Q 2416 1022 1997 1022 
Q 1575 1022 1294 1303 
Q 1013 1584 1013 2006 
Q 1013 2425 1300 2715 
Q 1588 3006 2003 3006 
z
" transform="scale(0.015625)"/>
       <path id="DejaVuSans-29" d="M 513 4856 
L 1013 4856 
Q 1481 4119 1714 3412 
Q 1947 2706 1947 2009 
Q 1947 1309 1714 600 
Q 1481 -109 1013 -844 
L 513 -844 
Q 928 -128 1133 580 
Q 1338 1288 1338 2009 
Q 1338 2731 1133 3434 
Q 928 4138 513 4856 
z
" transform="scale(0.015625)"/>
      </defs>
      <use xlink:href="#DejaVuSans-Oblique-3b8" transform="translate(0 0.234375)"/>
      <use xlink:href="#DejaVuSans-30" transform="translate(61.181641 -16.171875) scale(0.7)"/>
      <use xlink:href="#DejaVuSans-20" transform="translate(108.452148 0.234375)"/>
      <use xlink:href="#DejaVuSans-28" transform="translate(140.239258 0.234375)"/>
      <use xlink:href="#DejaVuSans-2218" transform="translate(180.209961 38.515625) scale(0.7)"/>
      <use xlink:href="#DejaVuSans-29" transform="translate(226.762695 0.234375)"/>
     </g>
    </g>
   </g>
   <g id="patch_3">
    <path d="M 57.6 307.584 
L 57.6 41.472 
" style="fill: none; stroke: #000000; stroke-width: 0.8; stroke-linejoin: miter; stroke-linecap: square"/>
   </g>
   <g id="patch_4">
    <path d="M 343.296 307.584 
L 343.296 41.472 
" style="fill: none; stroke: #000000; stroke-width: 0.8; stroke-linejoin: miter; stroke-linecap: square"/>
   </g>
   <g id="patch_5">
    <path d="M 57.6 307.584 
L 343.296 307.584 
" style="fill: none; stroke: #000000; stroke-width: 0.8; stroke-linejoin: miter; stroke-linecap: square"/>
   </g>
   <g id="patch_6">
    <path d="M 57.6 41.472 
L 343.296 41.472 
" style="fill: none; stroke: #000000; stroke-width: 0.8; stroke-linejoin: miter; stroke-linecap: square"/>
   </g>
   <g id="text_19">
    <!-- $U_{\infty} = $10.0 $m.s^{-1}$ | $h_{0}$/c = 0.2 | $x_{p}$/c = 0.5 -->
    <g transform="translate(99.498 35.472) scale(0.1 -0.1)">
     <defs>
      <path id="DejaVuSans-Oblique-55" d="M 991 4666 
L 1625 4666 
L 1075 1831 
Q 1041 1641 1027 1517 
Q 1013 1394 1013 1300 
Q 1013 869 1253 645 
Q 1494 422 1959 422 
Q 2563 422 2898 753 
Q 3234 1084 3378 1831 
L 3928 4666 
L 4563 4666 
L 4000 1753 
Q 3816 809 3300 359 
Q 2784 -91 1888 -91 
Q 1188 -91 780 261 
Q 372 613 372 1216 
Q 372 1325 387 1461 
Q 403 1597 434 1753 
L 991 4666 
z
" transform="scale(0.015625)"/>
      <path id="DejaVuSans-221e" d="M 2916 1091 
Q 2819 1203 2666 1466 
Q 2456 1091 2272 925 
Q 2041 725 1681 725 
Q 1259 725 981 1041 
Q 688 1372 688 1919 
Q 688 2444 981 2800 
Q 1244 3116 1688 3116 
Q 1916 3116 2084 3022 
Q 2281 2919 2416 2741 
Q 2541 2581 2666 2366 
Q 2875 2741 3059 2906 
Q 3291 3106 3650 3106 
Q 4072 3106 4350 2791 
Q 4644 2459 4644 1913 
Q 4644 1388 4350 1031 
Q 4088 716 3644 716 
Q 3416 716 3247 809 
Q 3078 894 2916 1091 
z
M 1647 1134 
Q 2163 1134 2472 1884 
Q 2075 2703 1647 2703 
Q 1334 2703 1175 2478 
Q 1003 2238 1003 1919 
Q 1003 1569 1175 1353 
Q 1350 1134 1647 1134 
z
M 3684 2697 
Q 3219 2697 2859 1947 
Q 3253 1128 3684 1128 
Q 3997 1128 4156 1353 
Q 4328 1594 4328 1913 
Q 4328 2263 4156 2478 
Q 3981 2697 3684 2697 
z
" transform="scale(0.015625)"/>
      <path id="DejaVuSans-3d" d="M 678 2906 
L 4684 2906 
L 4684 2381 
L 678 2381 
L 678 2906 
z
M 678 1631 
L 4684 1631 
L 4684 1100 
L 678 1100 
L 678 1631 
z
" transform="scale(0.015625)"/>
      <path id="DejaVuSans-Oblique-6d" d="M 5747 2113 
L 5338 0 
L 4763 0 
L 5166 2094 
Q 5191 2228 5203 2325 
Q 5216 2422 5216 2491 
Q 5216 2772 5059 2928 
Q 4903 3084 4622 3084 
Q 4203 3084 3875 2770 
Q 3547 2456 3450 1953 
L 3066 0 
L 2491 0 
L 2900 2094 
Q 2925 2209 2937 2307 
Q 2950 2406 2950 2484 
Q 2950 2769 2794 2926 
Q 2638 3084 2363 3084 
Q 1938 3084 1609 2770 
Q 1281 2456 1184 1953 
L 800 0 
L 225 0 
L 909 3500 
L 1484 3500 
L 1375 2956 
Q 1609 3263 1923 3423 
Q 2238 3584 2597 3584 
Q 2978 3584 3223 3384 
Q 3469 3184 3519 2828 
Q 3781 3197 4126 3390 
Q 4472 3584 4856 3584 
Q 5306 3584 5551 3325 
Q 5797 3066 5797 2591 
Q 5797 2488 5784 2364 
Q 5772 2241 5747 2113 
z
" transform="scale(0.015625)"/>
      <path id="DejaVuSans-Oblique-73" d="M 3200 3397 
L 3091 2853 
Q 2863 2978 2609 3040 
Q 2356 3103 2088 3103 
Q 1634 3103 1373 2948 
Q 1113 2794 1113 2528 
Q 1113 2219 1719 2053 
Q 1766 2041 1788 2034 
L 1972 1978 
Q 2547 1819 2739 1644 
Q 2931 1469 2931 1166 
Q 2931 609 2489 259 
Q 2047 -91 1331 -91 
Q 1053 -91 747 -37 
Q 441 16 72 128 
L 184 722 
Q 500 559 806 475 
Q 1113 391 1394 391 
Q 1816 391 2080 572 
Q 2344 753 2344 1031 
Q 2344 1331 1650 1516 
L 1591 1531 
L 1394 1581 
Q 956 1697 753 1886 
Q 550 2075 550 2369 
Q 550 2928 970 3256 
Q 1391 3584 2113 3584 
Q 2397 3584 2667 3537 
Q 2938 3491 3200 3397 
z
" transform="scale(0.015625)"/>
      <path id="DejaVuSans-2212" d="M 678 2272 
L 4684 2272 
L 4684 1741 
L 678 1741 
L 678 2272 
z
" transform="scale(0.015625)"/>
      <path id="DejaVuSans-7c" d="M 1344 4891 
L 1344 -1509 
L 813 -1509 
L 813 4891 
L 1344 4891 
z
" transform="scale(0.015625)"/>
      <path id="DejaVuSans-Oblique-68" d="M 3566 2113 
L 3156 0 
L 2578 0 
L 2988 2091 
Q 3016 2238 3031 2350 
Q 3047 2463 3047 2528 
Q 3047 2791 2881 2937 
Q 2716 3084 2419 3084 
Q 1956 3084 1617 2771 
Q 1278 2459 1178 1941 
L 800 0 
L 225 0 
L 1172 4863 
L 1747 4863 
L 1375 2950 
Q 1594 3244 1934 3414 
Q 2275 3584 2650 3584 
Q 3113 3584 3367 3334 
Q 3622 3084 3622 2631 
Q 3622 2519 3608 2391 
Q 3594 2263 3566 2113 
z
" transform="scale(0.015625)"/>
      <path id="DejaVuSans-2f" d="M 1625 4666 
L 2156 4666 
L 531 -594 
L 0 -594 
L 1625 4666 
z
" transform="scale(0.015625)"/>
      <path id="DejaVuSans-63" d="M 3122 3366 
L 3122 2828 
Q 2878 2963 2633 3030 
Q 2388 3097 2138 3097 
Q 1578 3097 1268 2742 
Q 959 2388 959 1747 
Q 959 1106 1268 751 
Q 1578 397 2138 397 
Q 2388 397 2633 464 
Q 2878 531 3122 666 
L 3122 134 
Q 2881 22 2623 -34 
Q 2366 -91 2075 -91 
Q 1284 -91 818 406 
Q 353 903 353 1747 
Q 353 2603 823 3093 
Q 1294 3584 2113 3584 
Q 2378 3584 2631 3529 
Q 2884 3475 3122 3366 
z
" transform="scale(0.015625)"/>
      <path id="DejaVuSans-Oblique-78" d="M 3841 3500 
L 2234 1784 
L 3219 0 
L 2559 0 
L 1819 1388 
L 531 0 
L -166 0 
L 1556 1844 
L 641 3500 
L 1300 3500 
L 1972 2234 
L 3144 3500 
L 3841 3500 
z
" transform="scale(0.015625)"/>
      <path id="DejaVuSans-Oblique-70" d="M 3175 2156 
Q 3175 2616 2975 2859 
Q 2775 3103 2400 3103 
Q 2144 3103 1911 2972 
Q 1678 2841 1497 2591 
Q 1319 2344 1212 1994 
Q 1106 1644 1106 1300 
Q 1106 863 1306 627 
Q 1506 391 1875 391 
Q 2147 391 2380 519 
Q 2613 647 2778 891 
Q 2956 1147 3065 1494 
Q 3175 1841 3175 2156 
z
M 1394 2969 
Q 1625 3272 1939 3428 
Q 2253 3584 2638 3584 
Q 3175 3584 3472 3232 
Q 3769 2881 3769 2247 
Q 3769 1728 3584 1258 
Q 3400 788 3053 416 
Q 2822 169 2531 39 
Q 2241 -91 1919 -91 
Q 1547 -91 1294 64 
Q 1041 219 916 525 
L 556 -1331 
L -19 -1331 
L 922 3500 
L 1497 3500 
L 1394 2969 
z
" transform="scale(0.015625)"/>
     </defs>
     <use xlink:href="#DejaVuSans-Oblique-55" transform="translate(0 0.684375)"/>
     <use xlink:href="#DejaVuSans-221e" transform="translate(73.193359 -15.721875) scale(0.7)"/>
     <use xlink:href="#DejaVuSans-3d" transform="translate(153.720703 0.684375)"/>
     <use xlink:href="#DejaVuSans-31" transform="translate(256.992188 0.684375)"/>
     <use xlink:href="#DejaVuSans-30" transform="translate(320.615234 0.684375)"/>
     <use xlink:href="#DejaVuSans-2e" transform="translate(384.238281 0.684375)"/>
     <use xlink:href="#DejaVuSans-30" transform="translate(416.025391 0.684375)"/>
     <use xlink:href="#DejaVuSans-20" transform="translate(479.648438 0.684375)"/>
     <use xlink:href="#DejaVuSans-Oblique-6d" transform="translate(511.435547 0.684375)"/>
     <use xlink:href="#DejaVuSans-2e" transform="translate(608.847656 0.684375)"/>
     <use xlink:href="#DejaVuSans-Oblique-73" transform="translate(660.117188 0.684375)"/>
     <use xlink:href="#DejaVuSans-2212" transform="translate(716.866693 38.965625) scale(0.7)"/>
     <use xlink:href="#DejaVuSans-31" transform="translate(775.519036 38.965625) scale(0.7)"/>
     <use xlink:href="#DejaVuSans-20" transform="translate(822.789544 0.684375)"/>
     <use xlink:href="#DejaVuSans-7c" transform="translate(854.576654 0.684375)"/>
     <use xlink:href="#DejaVuSans-20" transform="translate(888.26806 0.684375)"/>
     <use xlink:href="#DejaVuSans-Oblique-68" transform="translate(920.055169 0.684375)"/>
     <use xlink:href="#DejaVuSans-30" transform="translate(983.434076 -15.721875) scale(0.7)"/>
     <use xlink:href="#DejaVuSans-2f" transform="translate(1030.704583 0.684375)"/>
     <use xlink:href="#DejaVuSans-63" transform="translate(1064.39599 0.684375)"/>
     <use xlink:href="#DejaVuSans-20" transform="translate(1119.376458 0.684375)"/>
     <use xlink:href="#DejaVuSans-3d" transform="translate(1151.163568 0.684375)"/>
     <use xlink:href="#DejaVuSans-20" transform="translate(1234.95263 0.684375)"/>
     <use xlink:href="#DejaVuSans-30" transform="translate(1266.73974 0.684375)"/>
     <use xlink:href="#DejaVuSans-2e" transform="translate(1330.362786 0.684375)"/>
     <use xlink:href="#DejaVuSans-32" transform="translate(1356.649896 0.684375)"/>
     <use xlink:href="#DejaVuSans-20" transform="translate(1420.272943 0.684375)"/>
     <use xlink:href="#DejaVuSans-7c" transform="translate(1452.060052 0.684375)"/>
     <use xlink:href="#DejaVuSans-20" transform="translate(1485.751458 0.684375)"/>
     <use xlink:href="#DejaVuSans-Oblique-78" transform="translate(1517.538568 0.684375)"/>
     <use xlink:href="#DejaVuSans-Oblique-70" transform="translate(1576.718255 -15.721875) scale(0.7)"/>
     <use xlink:href="#DejaVuSans-2f" transform="translate(1623.886224 0.684375)"/>
     <use xlink:href="#DejaVuSans-63" transform="translate(1657.57763 0.684375)"/>
     <use xlink:href="#DejaVuSans-20" transform="translate(1712.558099 0.684375)"/>
     <use xlink:href="#DejaVuSans-3d" transform="translate(1744.345208 0.684375)"/>
     <use xlink:href="#DejaVuSans-20" transform="translate(1828.134271 0.684375)"/>
     <use xlink:href="#DejaVuSans-30" transform="translate(1859.92138 0.684375)"/>
     <use xlink:href="#DejaVuSans-2e" transform="translate(1923.544427 0.684375)"/>
     <use xlink:href="#DejaVuSans-35" transform="translate(1955.331536 0.684375)"/>
    </g>
   </g>
  </g>
  <g id="axes_2">
   <g id="patch_7">
    <path d="M 361.152 307.584 
L 374.4576 307.584 
L 374.4576 41.472 
L 361.152 41.472 
z
" style="fill: #ffffff"/>
   </g>
   <g id="patch_8">
    <path clip-path="url(#p7920d01e7b)" style="fill: #ffffff; stroke: #ffffff; stroke-width: 0.01; stroke-linejoin: miter"/>
   </g>
   <g id="QuadMesh_1">
    <path d="M 361.152 307.584 
L 374.4576 307.584 
L 374.4576 287.113846 
L 361.152 287.113846 
L 361.152 307.584 
" clip-path="url(#p7920d01e7b)" style="fill: #440154"/>
    <path d="M 361.152 287.113846 
L 374.4576 287.113846 
L 374.4576 266.643692 
L 361.152 266.643692 
L 361.152 287.113846 
" clip-path="url(#p7920d01e7b)" style="fill: #440154"/>
    <path d="M 361.152 266.643692 
L 374.4576 266.643692 
L 374.4576 246.173538 
L 361.152 246.173538 
L 361.152 266.643692 
" clip-path="url(#p7920d01e7b)" style="fill: #440154"/>
    <path d="M 361.152 246.173538 
L 374.4576 246.173538 
L 374.4576 225.703385 
L 361.152 225.703385 
L 361.152 246.173538 
" clip-path="url(#p7920d01e7b)" style="fill: #440154"/>
    <path d="M 361.152 225.703385 
L 374.4576 225.703385 
L 374.4576 205.233231 
L 361.152 205.233231 
L 361.152 225.703385 
" clip-path="url(#p7920d01e7b)" style="fill: #440154"/>
    <path d="M 361.152 205.233231 
L 374.4576 205.233231 
L 374.4576 184.763077 
L 361.152 184.763077 
L 361.152 205.233231 
" clip-path="url(#p7920d01e7b)" style="fill: #440154"/>
    <path d="M 361.152 184.763077 
L 374.4576 184.763077 
L 374.4576 164.292923 
L 361.152 164.292923 
L 361.152 184.763077 
" clip-path="url(#p7920d01e7b)" style="fill: #440154"/>
    <path d="M 361.152 164.292923 
L 374.4576 164.292923 
L 374.4576 143.822769 
L 361.152 143.822769 
L 361.152 164.292923 
" clip-path="url(#p7920d01e7b)" style="fill: #440154"/>
    <path d="M 361.152 143.822769 
L 374.4576 143.822769 
L 374.4576 123.352615 
L 361.152 123.352615 
L 361.152 143.822769 
" clip-path="url(#p7920d01e7b)" style="fill: #482475"/>
    <path d="M 361.152 123.352615 
L 374.4576 123.352615 
L 374.4576 102.882462 
L 361.152 102.882462 
L 361.152 123.352615 
" clip-path="url(#p7920d01e7b)" style="fill: #355f8d"/>
    <path d="M 361.152 102.882462 
L 374.4576 102.882462 
L 374.4576 82.412308 
L 361.152 82.412308 
L 361.152 102.882462 
" clip-path="url(#p7920d01e7b)" style="fill: #21918c"/>
    <path d="M 361.152 82.412308 
L 374.4576 82.412308 
L 374.4576 61.942154 
L 361.152 61.942154 
L 361.152 82.412308 
" clip-path="url(#p7920d01e7b)" style="fill: #44bf70"/>
    <path d="M 361.152 61.942154 
L 374.4576 61.942154 
L 374.4576 41.472 
L 361.152 41.472 
L 361.152 61.942154 
" clip-path="url(#p7920d01e7b)" style="fill: #bddf26"/>
   </g>
   <g id="matplotlib.axis_3"/>
   <g id="matplotlib.axis_4">
    <g id="ytick_11">
     <g id="line2d_33">
      <defs>
       <path id="mb863549a29" d="M 0 0 
L 3.5 0 
" style="stroke: #000000; stroke-width: 0.8"/>
      </defs>
      <g>
       <use xlink:href="#mb863549a29" x="374.4576" y="307.584" style="stroke: #000000; stroke-width: 0.8"/>
      </g>
     </g>
     <g id="text_20">
      <!-- −1.6 -->
      <g transform="translate(381.4576 311.383219) scale(0.1 -0.1)">
       <use xlink:href="#DejaVuSans-2212"/>
       <use xlink:href="#DejaVuSans-31" x="83.789062"/>
       <use xlink:href="#DejaVuSans-2e" x="147.412109"/>
       <use xlink:href="#DejaVuSans-36" x="179.199219"/>
      </g>
     </g>
    </g>
    <g id="ytick_12">
     <g id="line2d_34">
      <g>
       <use xlink:href="#mb863549a29" x="374.4576" y="266.643692" style="stroke: #000000; stroke-width: 0.8"/>
      </g>
     </g>
     <g id="text_21">
      <!-- −1.2 -->
      <g transform="translate(381.4576 270.442911) scale(0.1 -0.1)">
       <use xlink:href="#DejaVuSans-2212"/>
       <use xlink:href="#DejaVuSans-31" x="83.789062"/>
       <use xlink:href="#DejaVuSans-2e" x="147.412109"/>
       <use xlink:href="#DejaVuSans-32" x="179.199219"/>
      </g>
     </g>
    </g>
    <g id="ytick_13">
     <g id="line2d_35">
      <g>
       <use xlink:href="#mb863549a29" x="374.4576" y="225.703385" style="stroke: #000000; stroke-width: 0.8"/>
      </g>
     </g>
     <g id="text_22">
      <!-- −0.8 -->
      <g transform="translate(381.4576 229.502603) scale(0.1 -0.1)">
       <use xlink:href="#DejaVuSans-2212"/>
       <use xlink:href="#DejaVuSans-30" x="83.789062"/>
       <use xlink:href="#DejaVuSans-2e" x="147.412109"/>
       <use xlink:href="#DejaVuSans-38" x="179.199219"/>
      </g>
     </g>
    </g>
    <g id="ytick_14">
     <g id="line2d_36">
      <g>
       <use xlink:href="#mb863549a29" x="374.4576" y="184.763077" style="stroke: #000000; stroke-width: 0.8"/>
      </g>
     </g>
     <g id="text_23">
      <!-- −0.4 -->
      <g transform="translate(381.4576 188.562296) scale(0.1 -0.1)">
       <use xlink:href="#DejaVuSans-2212"/>
       <use xlink:href="#DejaVuSans-30" x="83.789062"/>
       <use xlink:href="#DejaVuSans-2e" x="147.412109"/>
       <use xlink:href="#DejaVuSans-34" x="179.199219"/>
      </g>
     </g>
    </g>
    <g id="ytick_15">
     <g id="line2d_37">
      <g>
       <use xlink:href="#mb863549a29" x="374.4576" y="143.822769" style="stroke: #000000; stroke-width: 0.8"/>
      </g>
     </g>
     <g id="text_24">
      <!-- 0.0 -->
      <g transform="translate(381.4576 147.621988) scale(0.1 -0.1)">
       <use xlink:href="#DejaVuSans-30"/>
       <use xlink:href="#DejaVuSans-2e" x="63.623047"/>
       <use xlink:href="#DejaVuSans-30" x="95.410156"/>
      </g>
     </g>
    </g>
    <g id="ytick_16">
     <g id="line2d_38">
      <g>
       <use xlink:href="#mb863549a29" x="374.4576" y="102.882462" style="stroke: #000000; stroke-width: 0.8"/>
      </g>
     </g>
     <g id="text_25">
      <!-- 0.4 -->
      <g transform="translate(381.4576 106.68168) scale(0.1 -0.1)">
       <use xlink:href="#DejaVuSans-30"/>
       <use xlink:href="#DejaVuSans-2e" x="63.623047"/>
       <use xlink:href="#DejaVuSans-34" x="95.410156"/>
      </g>
     </g>
    </g>
    <g id="ytick_17">
     <g id="line2d_39">
      <g>
       <use xlink:href="#mb863549a29" x="374.4576" y="61.942154" style="stroke: #000000; stroke-width: 0.8"/>
      </g>
     </g>
     <g id="text_26">
      <!-- 0.8 -->
      <g transform="translate(381.4576 65.741373) scale(0.1 -0.1)">
       <use xlink:href="#DejaVuSans-30"/>
       <use xlink:href="#DejaVuSans-2e" x="63.623047"/>
       <use xlink:href="#DejaVuSans-38" x="95.410156"/>
      </g>
     </g>
    </g>
    <g id="text_27">
     <!-- $\eta$ -->
     <g transform="translate(417.318538 177.728) rotate(-90) scale(0.1 -0.1)">
      <defs>
       <path id="DejaVuSans-Oblique-3b7" d="M 3703 2113 
L 3034 -1331 
L 2459 -1331 
L 3125 2094 
Q 3222 2591 3075 2838 
Q 2931 3084 2544 3084 
Q 2078 3084 1750 2788 
Q 1425 2491 1325 1978 
L 941 0 
L 363 0 
L 1044 3500 
L 1622 3500 
L 1516 2956 
Q 1781 3272 2094 3428 
Q 2403 3584 2769 3584 
Q 3372 3584 3609 3213 
Q 3844 2838 3703 2113 
z
" transform="scale(0.015625)"/>
      </defs>
      <use xlink:href="#DejaVuSans-Oblique-3b7"/>
     </g>
    </g>
   </g>
   <g id="LineCollection_1"/>
   <g id="patch_9">
    <path d="M 361.152 307.584 
L 367.8048 307.584 
L 374.4576 307.584 
L 374.4576 41.472 
L 367.8048 41.472 
L 361.152 41.472 
L 361.152 307.584 
z
" style="fill: none; stroke: #000000; stroke-width: 0.8; stroke-linejoin: miter; stroke-linecap: square"/>
   </g>
  </g>
 </g>
 <defs>
  <clipPath id="pb31b5dd81e">
   <rect x="57.6" y="41.472" width="285.696" height="266.112"/>
  </clipPath>
  <clipPath id="p7920d01e7b">
   <rect x="361.152" y="41.472" width="13.3056" height="266.112"/>
  </clipPath>
 </defs>
</svg>
