<?xml version="1.0" encoding="utf-8" standalone="no"?>
<!DOCTYPE svg PUBLIC "-//W3C//DTD SVG 1.1//EN"
  "http://www.w3.org/Graphics/SVG/1.1/DTD/svg11.dtd">
<svg xmlns:xlink="http://www.w3.org/1999/xlink" width="460.8pt" height="345.6pt" viewBox="0 0 460.8 345.6" xmlns="http://www.w3.org/2000/svg" version="1.1">
 <metadata>
  <rdf:RDF xmlns:dc="http://purl.org/dc/elements/1.1/" xmlns:cc="http://creativecommons.org/ns#" xmlns:rdf="http://www.w3.org/1999/02/22-rdf-syntax-ns#">
   <cc:Work>
    <dc:type rdf:resource="http://purl.org/dc/dcmitype/StillImage"/>
    <dc:date>2024-06-19T08:32:37.702441</dc:date>
    <dc:format>image/svg+xml</dc:format>
    <dc:creator>
     <cc:Agent>
      <dc:title>Matplotlib v3.6.3, https://matplotlib.org/</dc:title>
     </cc:Agent>
    </dc:creator>
   </cc:Work>
  </rdf:RDF>
 </metadata>
 <defs>
  <style type="text/css">*{stroke-linejoin: round; stroke-linecap: butt}</style>
 </defs>
 <g id="figure_1">
  <g id="patch_1">
   <path d="M 0 345.6 
L 460.8 345.6 
L 460.8 0 
L 0 0 
z
" style="fill: #ffffff"/>
  </g>
  <g id="axes_1">
   <g id="patch_2">
    <path d="M 57.6 307.584 
L 414.72 307.584 
L 414.72 41.472 
L 57.6 41.472 
z
" style="fill: #ffffff"/>
   </g>
   <g id="matplotlib.axis_1">
    <g id="xtick_1">
     <g id="line2d_1">
      <path d="M 73.832727 307.584 
L 73.832727 41.472 
" clip-path="url(#p717908bc63)" style="fill: none; stroke: #b0b0b0; stroke-width: 0.8; stroke-linecap: square"/>
     </g>
     <g id="line2d_2">
      <defs>
       <path id="m5a514baf50" d="M 0 0 
L 0 3.5 
" style="stroke: #000000; stroke-width: 0.8"/>
      </defs>
      <g>
       <use xlink:href="#m5a514baf50" x="73.832727" y="307.584" style="stroke: #000000; stroke-width: 0.8"/>
      </g>
     </g>
     <g id="text_1">
      <!-- 0.0 -->
      <g transform="translate(65.881165 322.182437) scale(0.1 -0.1)">
       <defs>
        <path id="DejaVuSans-30" d="M 2034 4250 
Q 1547 4250 1301 3770 
Q 1056 3291 1056 2328 
Q 1056 1369 1301 889 
Q 1547 409 2034 409 
Q 2525 409 2770 889 
Q 3016 1369 3016 2328 
Q 3016 3291 2770 3770 
Q 2525 4250 2034 4250 
z
M 2034 4750 
Q 2819 4750 3233 4129 
Q 3647 3509 3647 2328 
Q 3647 1150 3233 529 
Q 2819 -91 2034 -91 
Q 1250 -91 836 529 
Q 422 1150 422 2328 
Q 422 3509 836 4129 
Q 1250 4750 2034 4750 
z
" transform="scale(0.015625)"/>
        <path id="DejaVuSans-2e" d="M 684 794 
L 1344 794 
L 1344 0 
L 684 0 
L 684 794 
z
" transform="scale(0.015625)"/>
       </defs>
       <use xlink:href="#DejaVuSans-30"/>
       <use xlink:href="#DejaVuSans-2e" x="63.623047"/>
       <use xlink:href="#DejaVuSans-30" x="95.410156"/>
      </g>
     </g>
    </g>
    <g id="xtick_2">
     <g id="line2d_3">
      <path d="M 138.763636 307.584 
L 138.763636 41.472 
" clip-path="url(#p717908bc63)" style="fill: none; stroke: #b0b0b0; stroke-width: 0.8; stroke-linecap: square"/>
     </g>
     <g id="line2d_4">
      <g>
       <use xlink:href="#m5a514baf50" x="138.763636" y="307.584" style="stroke: #000000; stroke-width: 0.8"/>
      </g>
     </g>
     <g id="text_2">
      <!-- 0.2 -->
      <g transform="translate(130.812074 322.182437) scale(0.1 -0.1)">
       <defs>
        <path id="DejaVuSans-32" d="M 1228 531 
L 3431 531 
L 3431 0 
L 469 0 
L 469 531 
Q 828 903 1448 1529 
Q 2069 2156 2228 2338 
Q 2531 2678 2651 2914 
Q 2772 3150 2772 3378 
Q 2772 3750 2511 3984 
Q 2250 4219 1831 4219 
Q 1534 4219 1204 4116 
Q 875 4013 500 3803 
L 500 4441 
Q 881 4594 1212 4672 
Q 1544 4750 1819 4750 
Q 2544 4750 2975 4387 
Q 3406 4025 3406 3419 
Q 3406 3131 3298 2873 
Q 3191 2616 2906 2266 
Q 2828 2175 2409 1742 
Q 1991 1309 1228 531 
z
" transform="scale(0.015625)"/>
       </defs>
       <use xlink:href="#DejaVuSans-30"/>
       <use xlink:href="#DejaVuSans-2e" x="63.623047"/>
       <use xlink:href="#DejaVuSans-32" x="95.410156"/>
      </g>
     </g>
    </g>
    <g id="xtick_3">
     <g id="line2d_5">
      <path d="M 203.694545 307.584 
L 203.694545 41.472 
" clip-path="url(#p717908bc63)" style="fill: none; stroke: #b0b0b0; stroke-width: 0.8; stroke-linecap: square"/>
     </g>
     <g id="line2d_6">
      <g>
       <use xlink:href="#m5a514baf50" x="203.694545" y="307.584" style="stroke: #000000; stroke-width: 0.8"/>
      </g>
     </g>
     <g id="text_3">
      <!-- 0.4 -->
      <g transform="translate(195.742983 322.182437) scale(0.1 -0.1)">
       <defs>
        <path id="DejaVuSans-34" d="M 2419 4116 
L 825 1625 
L 2419 1625 
L 2419 4116 
z
M 2253 4666 
L 3047 4666 
L 3047 1625 
L 3713 1625 
L 3713 1100 
L 3047 1100 
L 3047 0 
L 2419 0 
L 2419 1100 
L 313 1100 
L 313 1709 
L 2253 4666 
z
" transform="scale(0.015625)"/>
       </defs>
       <use xlink:href="#DejaVuSans-30"/>
       <use xlink:href="#DejaVuSans-2e" x="63.623047"/>
       <use xlink:href="#DejaVuSans-34" x="95.410156"/>
      </g>
     </g>
    </g>
    <g id="xtick_4">
     <g id="line2d_7">
      <path d="M 268.625455 307.584 
L 268.625455 41.472 
" clip-path="url(#p717908bc63)" style="fill: none; stroke: #b0b0b0; stroke-width: 0.8; stroke-linecap: square"/>
     </g>
     <g id="line2d_8">
      <g>
       <use xlink:href="#m5a514baf50" x="268.625455" y="307.584" style="stroke: #000000; stroke-width: 0.8"/>
      </g>
     </g>
     <g id="text_4">
      <!-- 0.6 -->
      <g transform="translate(260.673892 322.182437) scale(0.1 -0.1)">
       <defs>
        <path id="DejaVuSans-36" d="M 2113 2584 
Q 1688 2584 1439 2293 
Q 1191 2003 1191 1497 
Q 1191 994 1439 701 
Q 1688 409 2113 409 
Q 2538 409 2786 701 
Q 3034 994 3034 1497 
Q 3034 2003 2786 2293 
Q 2538 2584 2113 2584 
z
M 3366 4563 
L 3366 3988 
Q 3128 4100 2886 4159 
Q 2644 4219 2406 4219 
Q 1781 4219 1451 3797 
Q 1122 3375 1075 2522 
Q 1259 2794 1537 2939 
Q 1816 3084 2150 3084 
Q 2853 3084 3261 2657 
Q 3669 2231 3669 1497 
Q 3669 778 3244 343 
Q 2819 -91 2113 -91 
Q 1303 -91 875 529 
Q 447 1150 447 2328 
Q 447 3434 972 4092 
Q 1497 4750 2381 4750 
Q 2619 4750 2861 4703 
Q 3103 4656 3366 4563 
z
" transform="scale(0.015625)"/>
       </defs>
       <use xlink:href="#DejaVuSans-30"/>
       <use xlink:href="#DejaVuSans-2e" x="63.623047"/>
       <use xlink:href="#DejaVuSans-36" x="95.410156"/>
      </g>
     </g>
    </g>
    <g id="xtick_5">
     <g id="line2d_9">
      <path d="M 333.556364 307.584 
L 333.556364 41.472 
" clip-path="url(#p717908bc63)" style="fill: none; stroke: #b0b0b0; stroke-width: 0.8; stroke-linecap: square"/>
     </g>
     <g id="line2d_10">
      <g>
       <use xlink:href="#m5a514baf50" x="333.556364" y="307.584" style="stroke: #000000; stroke-width: 0.8"/>
      </g>
     </g>
     <g id="text_5">
      <!-- 0.8 -->
      <g transform="translate(325.604801 322.182437) scale(0.1 -0.1)">
       <defs>
        <path id="DejaVuSans-38" d="M 2034 2216 
Q 1584 2216 1326 1975 
Q 1069 1734 1069 1313 
Q 1069 891 1326 650 
Q 1584 409 2034 409 
Q 2484 409 2743 651 
Q 3003 894 3003 1313 
Q 3003 1734 2745 1975 
Q 2488 2216 2034 2216 
z
M 1403 2484 
Q 997 2584 770 2862 
Q 544 3141 544 3541 
Q 544 4100 942 4425 
Q 1341 4750 2034 4750 
Q 2731 4750 3128 4425 
Q 3525 4100 3525 3541 
Q 3525 3141 3298 2862 
Q 3072 2584 2669 2484 
Q 3125 2378 3379 2068 
Q 3634 1759 3634 1313 
Q 3634 634 3220 271 
Q 2806 -91 2034 -91 
Q 1263 -91 848 271 
Q 434 634 434 1313 
Q 434 1759 690 2068 
Q 947 2378 1403 2484 
z
M 1172 3481 
Q 1172 3119 1398 2916 
Q 1625 2713 2034 2713 
Q 2441 2713 2670 2916 
Q 2900 3119 2900 3481 
Q 2900 3844 2670 4047 
Q 2441 4250 2034 4250 
Q 1625 4250 1398 4047 
Q 1172 3844 1172 3481 
z
" transform="scale(0.015625)"/>
       </defs>
       <use xlink:href="#DejaVuSans-30"/>
       <use xlink:href="#DejaVuSans-2e" x="63.623047"/>
       <use xlink:href="#DejaVuSans-38" x="95.410156"/>
      </g>
     </g>
    </g>
    <g id="xtick_6">
     <g id="line2d_11">
      <path d="M 398.487273 307.584 
L 398.487273 41.472 
" clip-path="url(#p717908bc63)" style="fill: none; stroke: #b0b0b0; stroke-width: 0.8; stroke-linecap: square"/>
     </g>
     <g id="line2d_12">
      <g>
       <use xlink:href="#m5a514baf50" x="398.487273" y="307.584" style="stroke: #000000; stroke-width: 0.8"/>
      </g>
     </g>
     <g id="text_6">
      <!-- 1.0 -->
      <g transform="translate(390.53571 322.182437) scale(0.1 -0.1)">
       <defs>
        <path id="DejaVuSans-31" d="M 794 531 
L 1825 531 
L 1825 4091 
L 703 3866 
L 703 4441 
L 1819 4666 
L 2450 4666 
L 2450 531 
L 3481 531 
L 3481 0 
L 794 0 
L 794 531 
z
" transform="scale(0.015625)"/>
       </defs>
       <use xlink:href="#DejaVuSans-31"/>
       <use xlink:href="#DejaVuSans-2e" x="63.623047"/>
       <use xlink:href="#DejaVuSans-30" x="95.410156"/>
      </g>
     </g>
    </g>
    <g id="text_7">
     <!-- Dimensionless Time $\frac{t}{T}$ -->
     <g transform="translate(181.56 337.562125) scale(0.1 -0.1)">
      <defs>
       <path id="DejaVuSans-44" d="M 1259 4147 
L 1259 519 
L 2022 519 
Q 2988 519 3436 956 
Q 3884 1394 3884 2338 
Q 3884 3275 3436 3711 
Q 2988 4147 2022 4147 
L 1259 4147 
z
M 628 4666 
L 1925 4666 
Q 3281 4666 3915 4102 
Q 4550 3538 4550 2338 
Q 4550 1131 3912 565 
Q 3275 0 1925 0 
L 628 0 
L 628 4666 
z
" transform="scale(0.015625)"/>
       <path id="DejaVuSans-69" d="M 603 3500 
L 1178 3500 
L 1178 0 
L 603 0 
L 603 3500 
z
M 603 4863 
L 1178 4863 
L 1178 4134 
L 603 4134 
L 603 4863 
z
" transform="scale(0.015625)"/>
       <path id="DejaVuSans-6d" d="M 3328 2828 
Q 3544 3216 3844 3400 
Q 4144 3584 4550 3584 
Q 5097 3584 5394 3201 
Q 5691 2819 5691 2113 
L 5691 0 
L 5113 0 
L 5113 2094 
Q 5113 2597 4934 2840 
Q 4756 3084 4391 3084 
Q 3944 3084 3684 2787 
Q 3425 2491 3425 1978 
L 3425 0 
L 2847 0 
L 2847 2094 
Q 2847 2600 2669 2842 
Q 2491 3084 2119 3084 
Q 1678 3084 1418 2786 
Q 1159 2488 1159 1978 
L 1159 0 
L 581 0 
L 581 3500 
L 1159 3500 
L 1159 2956 
Q 1356 3278 1631 3431 
Q 1906 3584 2284 3584 
Q 2666 3584 2933 3390 
Q 3200 3197 3328 2828 
z
" transform="scale(0.015625)"/>
       <path id="DejaVuSans-65" d="M 3597 1894 
L 3597 1613 
L 953 1613 
Q 991 1019 1311 708 
Q 1631 397 2203 397 
Q 2534 397 2845 478 
Q 3156 559 3463 722 
L 3463 178 
Q 3153 47 2828 -22 
Q 2503 -91 2169 -91 
Q 1331 -91 842 396 
Q 353 884 353 1716 
Q 353 2575 817 3079 
Q 1281 3584 2069 3584 
Q 2775 3584 3186 3129 
Q 3597 2675 3597 1894 
z
M 3022 2063 
Q 3016 2534 2758 2815 
Q 2500 3097 2075 3097 
Q 1594 3097 1305 2825 
Q 1016 2553 972 2059 
L 3022 2063 
z
" transform="scale(0.015625)"/>
       <path id="DejaVuSans-6e" d="M 3513 2113 
L 3513 0 
L 2938 0 
L 2938 2094 
Q 2938 2591 2744 2837 
Q 2550 3084 2163 3084 
Q 1697 3084 1428 2787 
Q 1159 2491 1159 1978 
L 1159 0 
L 581 0 
L 581 3500 
L 1159 3500 
L 1159 2956 
Q 1366 3272 1645 3428 
Q 1925 3584 2291 3584 
Q 2894 3584 3203 3211 
Q 3513 2838 3513 2113 
z
" transform="scale(0.015625)"/>
       <path id="DejaVuSans-73" d="M 2834 3397 
L 2834 2853 
Q 2591 2978 2328 3040 
Q 2066 3103 1784 3103 
Q 1356 3103 1142 2972 
Q 928 2841 928 2578 
Q 928 2378 1081 2264 
Q 1234 2150 1697 2047 
L 1894 2003 
Q 2506 1872 2764 1633 
Q 3022 1394 3022 966 
Q 3022 478 2636 193 
Q 2250 -91 1575 -91 
Q 1294 -91 989 -36 
Q 684 19 347 128 
L 347 722 
Q 666 556 975 473 
Q 1284 391 1588 391 
Q 1994 391 2212 530 
Q 2431 669 2431 922 
Q 2431 1156 2273 1281 
Q 2116 1406 1581 1522 
L 1381 1569 
Q 847 1681 609 1914 
Q 372 2147 372 2553 
Q 372 3047 722 3315 
Q 1072 3584 1716 3584 
Q 2034 3584 2315 3537 
Q 2597 3491 2834 3397 
z
" transform="scale(0.015625)"/>
       <path id="DejaVuSans-6f" d="M 1959 3097 
Q 1497 3097 1228 2736 
Q 959 2375 959 1747 
Q 959 1119 1226 758 
Q 1494 397 1959 397 
Q 2419 397 2687 759 
Q 2956 1122 2956 1747 
Q 2956 2369 2687 2733 
Q 2419 3097 1959 3097 
z
M 1959 3584 
Q 2709 3584 3137 3096 
Q 3566 2609 3566 1747 
Q 3566 888 3137 398 
Q 2709 -91 1959 -91 
Q 1206 -91 779 398 
Q 353 888 353 1747 
Q 353 2609 779 3096 
Q 1206 3584 1959 3584 
z
" transform="scale(0.015625)"/>
       <path id="DejaVuSans-6c" d="M 603 4863 
L 1178 4863 
L 1178 0 
L 603 0 
L 603 4863 
z
" transform="scale(0.015625)"/>
       <path id="DejaVuSans-20" transform="scale(0.015625)"/>
       <path id="DejaVuSans-54" d="M -19 4666 
L 3928 4666 
L 3928 4134 
L 2272 4134 
L 2272 0 
L 1638 0 
L 1638 4134 
L -19 4134 
L -19 4666 
z
" transform="scale(0.015625)"/>
       <path id="DejaVuSans-Oblique-74" d="M 2706 3500 
L 2619 3053 
L 1472 3053 
L 1100 1153 
Q 1081 1047 1072 975 
Q 1063 903 1063 863 
Q 1063 663 1183 572 
Q 1303 481 1569 481 
L 2150 481 
L 2053 0 
L 1503 0 
Q 991 0 739 200 
Q 488 400 488 806 
Q 488 878 497 964 
Q 506 1050 525 1153 
L 897 3053 
L 409 3053 
L 500 3500 
L 978 3500 
L 1172 4494 
L 1747 4494 
L 1556 3500 
L 2706 3500 
z
" transform="scale(0.015625)"/>
       <path id="DejaVuSans-Oblique-54" d="M 378 4666 
L 4325 4666 
L 4225 4134 
L 2559 4134 
L 1759 0 
L 1125 0 
L 1925 4134 
L 275 4134 
L 378 4666 
z
" transform="scale(0.015625)"/>
      </defs>
      <use xlink:href="#DejaVuSans-44" transform="translate(0 0.05)"/>
      <use xlink:href="#DejaVuSans-69" transform="translate(77.001953 0.05)"/>
      <use xlink:href="#DejaVuSans-6d" transform="translate(104.785156 0.05)"/>
      <use xlink:href="#DejaVuSans-65" transform="translate(202.197266 0.05)"/>
      <use xlink:href="#DejaVuSans-6e" transform="translate(263.720703 0.05)"/>
      <use xlink:href="#DejaVuSans-73" transform="translate(327.099609 0.05)"/>
      <use xlink:href="#DejaVuSans-69" transform="translate(379.199219 0.05)"/>
      <use xlink:href="#DejaVuSans-6f" transform="translate(406.982422 0.05)"/>
      <use xlink:href="#DejaVuSans-6e" transform="translate(468.164062 0.05)"/>
      <use xlink:href="#DejaVuSans-6c" transform="translate(531.542969 0.05)"/>
      <use xlink:href="#DejaVuSans-65" transform="translate(559.326172 0.05)"/>
      <use xlink:href="#DejaVuSans-73" transform="translate(620.849609 0.05)"/>
      <use xlink:href="#DejaVuSans-73" transform="translate(672.949219 0.05)"/>
      <use xlink:href="#DejaVuSans-20" transform="translate(725.048828 0.05)"/>
      <use xlink:href="#DejaVuSans-54" transform="translate(756.835938 0.05)"/>
      <use xlink:href="#DejaVuSans-69" transform="translate(817.919922 0.05)"/>
      <use xlink:href="#DejaVuSans-6d" transform="translate(845.703125 0.05)"/>
      <use xlink:href="#DejaVuSans-65" transform="translate(943.115234 0.05)"/>
      <use xlink:href="#DejaVuSans-20" transform="translate(1004.638672 0.05)"/>
      <use xlink:href="#DejaVuSans-Oblique-74" transform="translate(1044.425781 43.846875) scale(0.7)"/>
      <use xlink:href="#DejaVuSans-Oblique-54" transform="translate(1036.425781 -38.4375) scale(0.7)"/>
      <path d="M 1036.425781 18.846875 
L 1036.425781 25.096875 
L 1079.18457 25.096875 
L 1079.18457 18.846875 
L 1036.425781 18.846875 
z
"/>
     </g>
    </g>
   </g>
   <g id="matplotlib.axis_2">
    <g id="ytick_1">
     <g id="line2d_13">
      <path d="M 57.6 290.690494 
L 414.72 290.690494 
" clip-path="url(#p717908bc63)" style="fill: none; stroke: #b0b0b0; stroke-width: 0.8; stroke-linecap: square"/>
     </g>
     <g id="line2d_14">
      <defs>
       <path id="m384c173b25" d="M 0 0 
L -3.5 0 
" style="stroke: #000000; stroke-width: 0.8"/>
      </defs>
      <g>
       <use xlink:href="#m384c173b25" x="57.6" y="290.690494" style="stroke: #000000; stroke-width: 0.8"/>
      </g>
     </g>
     <g id="text_8">
      <!-- −50 -->
      <g transform="translate(29.495313 294.489713) scale(0.1 -0.1)">
       <defs>
        <path id="DejaVuSans-2212" d="M 678 2272 
L 4684 2272 
L 4684 1741 
L 678 1741 
L 678 2272 
z
" transform="scale(0.015625)"/>
        <path id="DejaVuSans-35" d="M 691 4666 
L 3169 4666 
L 3169 4134 
L 1269 4134 
L 1269 2991 
Q 1406 3038 1543 3061 
Q 1681 3084 1819 3084 
Q 2600 3084 3056 2656 
Q 3513 2228 3513 1497 
Q 3513 744 3044 326 
Q 2575 -91 1722 -91 
Q 1428 -91 1123 -41 
Q 819 9 494 109 
L 494 744 
Q 775 591 1075 516 
Q 1375 441 1709 441 
Q 2250 441 2565 725 
Q 2881 1009 2881 1497 
Q 2881 1984 2565 2268 
Q 2250 2553 1709 2553 
Q 1456 2553 1204 2497 
Q 953 2441 691 2322 
L 691 4666 
z
" transform="scale(0.015625)"/>
       </defs>
       <use xlink:href="#DejaVuSans-2212"/>
       <use xlink:href="#DejaVuSans-35" x="83.789062"/>
       <use xlink:href="#DejaVuSans-30" x="147.412109"/>
      </g>
     </g>
    </g>
    <g id="ytick_2">
     <g id="line2d_15">
      <path d="M 57.6 252.173252 
L 414.72 252.173252 
" clip-path="url(#p717908bc63)" style="fill: none; stroke: #b0b0b0; stroke-width: 0.8; stroke-linecap: square"/>
     </g>
     <g id="line2d_16">
      <g>
       <use xlink:href="#m384c173b25" x="57.6" y="252.173252" style="stroke: #000000; stroke-width: 0.8"/>
      </g>
     </g>
     <g id="text_9">
      <!-- 0 -->
      <g transform="translate(44.2375 255.972471) scale(0.1 -0.1)">
       <use xlink:href="#DejaVuSans-30"/>
      </g>
     </g>
    </g>
    <g id="ytick_3">
     <g id="line2d_17">
      <path d="M 57.6 213.65601 
L 414.72 213.65601 
" clip-path="url(#p717908bc63)" style="fill: none; stroke: #b0b0b0; stroke-width: 0.8; stroke-linecap: square"/>
     </g>
     <g id="line2d_18">
      <g>
       <use xlink:href="#m384c173b25" x="57.6" y="213.65601" style="stroke: #000000; stroke-width: 0.8"/>
      </g>
     </g>
     <g id="text_10">
      <!-- 50 -->
      <g transform="translate(37.875 217.455229) scale(0.1 -0.1)">
       <use xlink:href="#DejaVuSans-35"/>
       <use xlink:href="#DejaVuSans-30" x="63.623047"/>
      </g>
     </g>
    </g>
    <g id="ytick_4">
     <g id="line2d_19">
      <path d="M 57.6 175.138768 
L 414.72 175.138768 
" clip-path="url(#p717908bc63)" style="fill: none; stroke: #b0b0b0; stroke-width: 0.8; stroke-linecap: square"/>
     </g>
     <g id="line2d_20">
      <g>
       <use xlink:href="#m384c173b25" x="57.6" y="175.138768" style="stroke: #000000; stroke-width: 0.8"/>
      </g>
     </g>
     <g id="text_11">
      <!-- 100 -->
      <g transform="translate(31.5125 178.937987) scale(0.1 -0.1)">
       <use xlink:href="#DejaVuSans-31"/>
       <use xlink:href="#DejaVuSans-30" x="63.623047"/>
       <use xlink:href="#DejaVuSans-30" x="127.246094"/>
      </g>
     </g>
    </g>
    <g id="ytick_5">
     <g id="line2d_21">
      <path d="M 57.6 136.621526 
L 414.72 136.621526 
" clip-path="url(#p717908bc63)" style="fill: none; stroke: #b0b0b0; stroke-width: 0.8; stroke-linecap: square"/>
     </g>
     <g id="line2d_22">
      <g>
       <use xlink:href="#m384c173b25" x="57.6" y="136.621526" style="stroke: #000000; stroke-width: 0.8"/>
      </g>
     </g>
     <g id="text_12">
      <!-- 150 -->
      <g transform="translate(31.5125 140.420745) scale(0.1 -0.1)">
       <use xlink:href="#DejaVuSans-31"/>
       <use xlink:href="#DejaVuSans-35" x="63.623047"/>
       <use xlink:href="#DejaVuSans-30" x="127.246094"/>
      </g>
     </g>
    </g>
    <g id="ytick_6">
     <g id="line2d_23">
      <path d="M 57.6 98.104284 
L 414.72 98.104284 
" clip-path="url(#p717908bc63)" style="fill: none; stroke: #b0b0b0; stroke-width: 0.8; stroke-linecap: square"/>
     </g>
     <g id="line2d_24">
      <g>
       <use xlink:href="#m384c173b25" x="57.6" y="98.104284" style="stroke: #000000; stroke-width: 0.8"/>
      </g>
     </g>
     <g id="text_13">
      <!-- 200 -->
      <g transform="translate(31.5125 101.903503) scale(0.1 -0.1)">
       <use xlink:href="#DejaVuSans-32"/>
       <use xlink:href="#DejaVuSans-30" x="63.623047"/>
       <use xlink:href="#DejaVuSans-30" x="127.246094"/>
      </g>
     </g>
    </g>
    <g id="ytick_7">
     <g id="line2d_25">
      <path d="M 57.6 59.587042 
L 414.72 59.587042 
" clip-path="url(#p717908bc63)" style="fill: none; stroke: #b0b0b0; stroke-width: 0.8; stroke-linecap: square"/>
     </g>
     <g id="line2d_26">
      <g>
       <use xlink:href="#m384c173b25" x="57.6" y="59.587042" style="stroke: #000000; stroke-width: 0.8"/>
      </g>
     </g>
     <g id="text_14">
      <!-- 250 -->
      <g transform="translate(31.5125 63.386261) scale(0.1 -0.1)">
       <use xlink:href="#DejaVuSans-32"/>
       <use xlink:href="#DejaVuSans-35" x="63.623047"/>
       <use xlink:href="#DejaVuSans-30" x="127.246094"/>
      </g>
     </g>
    </g>
    <g id="text_15">
     <!-- Power ($W$) -->
     <g transform="translate(23.415625 200.278) rotate(-90) scale(0.1 -0.1)">
      <defs>
       <path id="DejaVuSans-50" d="M 1259 4147 
L 1259 2394 
L 2053 2394 
Q 2494 2394 2734 2622 
Q 2975 2850 2975 3272 
Q 2975 3691 2734 3919 
Q 2494 4147 2053 4147 
L 1259 4147 
z
M 628 4666 
L 2053 4666 
Q 2838 4666 3239 4311 
Q 3641 3956 3641 3272 
Q 3641 2581 3239 2228 
Q 2838 1875 2053 1875 
L 1259 1875 
L 1259 0 
L 628 0 
L 628 4666 
z
" transform="scale(0.015625)"/>
       <path id="DejaVuSans-77" d="M 269 3500 
L 844 3500 
L 1563 769 
L 2278 3500 
L 2956 3500 
L 3675 769 
L 4391 3500 
L 4966 3500 
L 4050 0 
L 3372 0 
L 2619 2869 
L 1863 0 
L 1184 0 
L 269 3500 
z
" transform="scale(0.015625)"/>
       <path id="DejaVuSans-72" d="M 2631 2963 
Q 2534 3019 2420 3045 
Q 2306 3072 2169 3072 
Q 1681 3072 1420 2755 
Q 1159 2438 1159 1844 
L 1159 0 
L 581 0 
L 581 3500 
L 1159 3500 
L 1159 2956 
Q 1341 3275 1631 3429 
Q 1922 3584 2338 3584 
Q 2397 3584 2469 3576 
Q 2541 3569 2628 3553 
L 2631 2963 
z
" transform="scale(0.015625)"/>
       <path id="DejaVuSans-28" d="M 1984 4856 
Q 1566 4138 1362 3434 
Q 1159 2731 1159 2009 
Q 1159 1288 1364 580 
Q 1569 -128 1984 -844 
L 1484 -844 
Q 1016 -109 783 600 
Q 550 1309 550 2009 
Q 550 2706 781 3412 
Q 1013 4119 1484 4856 
L 1984 4856 
z
" transform="scale(0.015625)"/>
       <path id="DejaVuSans-Oblique-57" d="M 616 4666 
L 1228 4666 
L 1453 697 
L 3213 4666 
L 3916 4666 
L 4147 697 
L 5888 4666 
L 6528 4666 
L 4453 0 
L 3659 0 
L 3444 3891 
L 1697 0 
L 903 0 
L 616 4666 
z
" transform="scale(0.015625)"/>
       <path id="DejaVuSans-29" d="M 513 4856 
L 1013 4856 
Q 1481 4119 1714 3412 
Q 1947 2706 1947 2009 
Q 1947 1309 1714 600 
Q 1481 -109 1013 -844 
L 513 -844 
Q 928 -128 1133 580 
Q 1338 1288 1338 2009 
Q 1338 2731 1133 3434 
Q 928 4138 513 4856 
z
" transform="scale(0.015625)"/>
      </defs>
      <use xlink:href="#DejaVuSans-50" transform="translate(0 0.125)"/>
      <use xlink:href="#DejaVuSans-6f" transform="translate(60.302734 0.125)"/>
      <use xlink:href="#DejaVuSans-77" transform="translate(121.484375 0.125)"/>
      <use xlink:href="#DejaVuSans-65" transform="translate(203.271484 0.125)"/>
      <use xlink:href="#DejaVuSans-72" transform="translate(264.794922 0.125)"/>
      <use xlink:href="#DejaVuSans-20" transform="translate(305.908203 0.125)"/>
      <use xlink:href="#DejaVuSans-28" transform="translate(337.695312 0.125)"/>
      <use xlink:href="#DejaVuSans-Oblique-57" transform="translate(376.708984 0.125)"/>
      <use xlink:href="#DejaVuSans-29" transform="translate(475.585938 0.125)"/>
     </g>
    </g>
   </g>
   <g id="line2d_27">
    <path d="M 73.832727 80.316262 
L 76.429964 88.411111 
L 79.0272 97.375376 
L 81.624436 107.118536 
L 84.221673 117.542205 
L 88.117527 134.221791 
L 93.312 157.815021 
L 104.999564 211.870201 
L 108.895418 228.731972 
L 112.791273 244.363076 
L 115.388509 253.923515 
L 117.985745 262.68203 
L 120.582982 270.55018 
L 123.180218 277.44851 
L 125.777455 283.307364 
L 127.076073 285.828071 
L 128.374691 288.067577 
L 129.673309 290.020224 
L 130.971927 291.681081 
L 132.270545 293.045952 
L 133.569164 294.111388 
L 134.867782 294.874699 
L 136.1664 295.333957 
L 137.465018 295.488 
L 138.763636 295.336441 
L 140.062255 294.879661 
L 141.360873 294.118815 
L 142.659491 293.055825 
L 143.958109 291.693376 
L 145.256727 290.03491 
L 146.555345 288.084615 
L 147.853964 285.84742 
L 149.152582 283.328974 
L 150.4512 280.53564 
L 153.048436 274.153209 
L 155.645673 266.764576 
L 158.242909 258.444352 
L 160.840145 249.276554 
L 163.437382 239.353757 
L 167.333236 223.274966 
L 171.229091 206.089361 
L 177.722182 176.054149 
L 185.513891 140.051615 
L 189.409745 123.021309 
L 193.3056 107.159599 
L 195.902836 97.413469 
L 198.500073 88.445849 
L 201.097309 80.347294 
L 203.694545 73.199583 
L 206.291782 67.074893 
L 207.5904 64.415929 
L 208.889018 62.03507 
L 210.187636 59.938331 
L 211.486255 58.131008 
L 212.784873 56.617667 
L 214.083491 55.402129 
L 215.382109 54.487467 
L 216.680727 53.87599 
L 217.979345 53.569242 
L 219.277964 53.568 
L 220.576582 53.872266 
L 221.8752 54.481271 
L 223.173818 55.393477 
L 224.472436 56.606579 
L 225.771055 58.117514 
L 227.069673 59.922465 
L 228.368291 62.016871 
L 229.666909 64.395443 
L 230.965527 67.052172 
L 233.562764 73.17257 
L 236.16 80.316262 
L 238.757236 88.411111 
L 241.354473 97.375376 
L 243.951709 107.118536 
L 246.548945 117.542205 
L 250.4448 134.221791 
L 255.639273 157.815021 
L 267.326836 211.870201 
L 271.222691 228.731972 
L 275.118545 244.363076 
L 277.715782 253.923515 
L 280.313018 262.68203 
L 282.910255 270.55018 
L 285.507491 277.44851 
L 288.104727 283.307364 
L 289.403345 285.828071 
L 290.701964 288.067577 
L 292.000582 290.020224 
L 293.2992 291.681081 
L 294.597818 293.045952 
L 295.896436 294.111388 
L 297.195055 294.874699 
L 298.493673 295.333957 
L 299.792291 295.488 
L 301.090909 295.336441 
L 302.389527 294.879661 
L 303.688145 294.118815 
L 304.986764 293.055825 
L 306.285382 291.693376 
L 307.584 290.03491 
L 308.882618 288.084615 
L 310.181236 285.84742 
L 311.479855 283.328974 
L 312.778473 280.53564 
L 315.375709 274.153209 
L 317.972945 266.764576 
L 320.570182 258.444352 
L 323.167418 249.276554 
L 325.764655 239.353757 
L 329.660509 223.274966 
L 333.556364 206.089361 
L 340.049455 176.054149 
L 347.841164 140.051615 
L 351.737018 123.021309 
L 355.632873 107.159599 
L 358.230109 97.413469 
L 360.827345 88.445849 
L 363.424582 80.347294 
L 366.021818 73.199583 
L 368.619055 67.074893 
L 369.917673 64.415929 
L 371.216291 62.03507 
L 372.514909 59.938331 
L 373.813527 58.131008 
L 375.112145 56.617667 
L 376.410764 55.402129 
L 377.709382 54.487467 
L 379.008 53.87599 
L 380.306618 53.569242 
L 381.605236 53.568 
L 382.903855 53.872266 
L 384.202473 54.481271 
L 385.501091 55.393477 
L 386.799709 56.606579 
L 388.098327 58.117514 
L 389.396945 59.922465 
L 390.695564 62.016871 
L 391.994182 64.395443 
L 393.2928 67.052172 
L 395.890036 73.17257 
L 398.487273 80.316262 
L 398.487273 80.316262 
" clip-path="url(#p717908bc63)" style="fill: none; stroke: #1f77b4; stroke-width: 1.5; stroke-linecap: square"/>
   </g>
   <g id="line2d_28">
    <path d="M 73.832727 125.415795 
L 75.131345 126.24902 
L 76.429964 127.240241 
L 77.728582 128.386953 
L 80.325818 131.134879 
L 82.923055 134.465051 
L 85.520291 138.343839 
L 88.117527 142.732077 
L 90.714764 147.585452 
L 93.312 152.854955 
L 97.207855 161.422031 
L 101.103709 170.610368 
L 106.298182 183.465999 
L 115.388509 206.162884 
L 119.284364 215.39525 
L 123.180218 224.023872 
L 125.777455 229.343462 
L 128.374691 234.253591 
L 130.971927 238.704675 
L 133.569164 242.651768 
L 136.1664 246.055013 
L 138.763636 248.880043 
L 140.062255 250.066577 
L 141.360873 251.098332 
L 142.659491 251.972702 
L 143.958109 252.687479 
L 145.256727 253.240856 
L 146.555345 253.631437 
L 147.853964 253.858234 
L 149.152582 253.920674 
L 150.4512 253.8186 
L 151.749818 253.552269 
L 153.048436 253.122355 
L 154.347055 252.529943 
L 155.645673 251.77653 
L 156.944291 250.864019 
L 158.242909 249.794715 
L 160.840145 247.196922 
L 163.437382 244.009383 
L 166.034618 240.264287 
L 168.631855 235.999451 
L 171.229091 231.257941 
L 173.826327 226.087637 
L 177.722182 217.643455 
L 181.618036 208.544504 
L 186.812509 195.752534 
L 197.201455 169.854265 
L 201.097309 160.708284 
L 204.993164 152.199762 
L 207.5904 146.977654 
L 210.187636 142.177811 
L 212.784873 137.848702 
L 215.382109 134.034043 
L 217.979345 130.772352 
L 220.576582 128.096568 
L 221.8752 126.987073 
L 223.173818 126.03371 
L 224.472436 125.238885 
L 225.771055 124.604608 
L 227.069673 124.13248 
L 228.368291 123.823693 
L 229.666909 123.679029 
L 230.965527 123.698852 
L 232.264145 123.883113 
L 233.562764 124.231345 
L 234.861382 124.74267 
L 236.16 125.415795 
L 237.458618 126.24902 
L 238.757236 127.240241 
L 240.055855 128.386953 
L 242.653091 131.134879 
L 245.250327 134.465051 
L 247.847564 138.343839 
L 250.4448 142.732077 
L 253.042036 147.585452 
L 255.639273 152.854955 
L 259.535127 161.422031 
L 263.430982 170.610368 
L 268.625455 183.465999 
L 277.715782 206.162884 
L 281.611636 215.39525 
L 285.507491 224.023872 
L 288.104727 229.343462 
L 290.701964 234.253591 
L 293.2992 238.704675 
L 295.896436 242.651768 
L 298.493673 246.055013 
L 301.090909 248.880043 
L 302.389527 250.066577 
L 303.688145 251.098332 
L 304.986764 251.972702 
L 306.285382 252.687479 
L 307.584 253.240856 
L 308.882618 253.631437 
L 310.181236 253.858234 
L 311.479855 253.920674 
L 312.778473 253.8186 
L 314.077091 253.552269 
L 315.375709 253.122355 
L 316.674327 252.529943 
L 317.972945 251.77653 
L 319.271564 250.864019 
L 320.570182 249.794715 
L 323.167418 247.196922 
L 325.764655 244.009383 
L 328.361891 240.264287 
L 330.959127 235.999451 
L 333.556364 231.257941 
L 336.1536 226.087637 
L 340.049455 217.643455 
L 343.945309 208.544504 
L 349.139782 195.752534 
L 359.528727 169.854265 
L 363.424582 160.708284 
L 367.320436 152.199762 
L 369.917673 146.977654 
L 372.514909 142.177811 
L 375.112145 137.848702 
L 377.709382 134.034043 
L 380.306618 130.772352 
L 382.903855 128.096568 
L 384.202473 126.987073 
L 385.501091 126.03371 
L 386.799709 125.238885 
L 388.098327 124.604608 
L 389.396945 124.13248 
L 390.695564 123.823693 
L 391.994182 123.679029 
L 393.2928 123.698852 
L 394.591418 123.883113 
L 395.890036 124.231345 
L 397.188655 124.74267 
L 398.487273 125.415795 
L 398.487273 125.415795 
" clip-path="url(#p717908bc63)" style="fill: none; stroke: #ff7f0e; stroke-width: 1.5; stroke-linecap: square"/>
   </g>
   <g id="line2d_29">
    <path d="M 73.832727 252.173252 
L 79.0272 256.904205 
L 93.312 270.123088 
L 97.207855 273.398775 
L 101.103709 276.387512 
L 104.999564 279.021466 
L 107.5968 280.550437 
L 110.194036 281.879524 
L 112.791273 282.995305 
L 115.388509 283.886512 
L 117.985745 284.544147 
L 120.582982 284.961569 
L 123.180218 285.134563 
L 125.777455 285.061381 
L 128.374691 284.742764 
L 130.971927 284.181927 
L 133.569164 283.384535 
L 136.1664 282.358639 
L 138.763636 281.114599 
L 141.360873 279.664978 
L 143.958109 278.024413 
L 147.853964 275.242272 
L 151.749818 272.13134 
L 156.944291 267.594892 
L 163.437382 261.559436 
L 172.527709 253.111078 
L 177.722182 248.640922 
L 181.618036 245.599454 
L 185.513891 242.901983 
L 188.111127 241.325377 
L 190.708364 239.94498 
L 193.3056 238.77473 
L 195.902836 237.826445 
L 198.500073 237.109701 
L 201.097309 236.631735 
L 203.694545 236.397373 
L 206.291782 236.408983 
L 208.889018 236.666447 
L 211.486255 237.167165 
L 214.083491 237.906081 
L 216.680727 238.875734 
L 219.277964 240.066331 
L 221.8752 241.465851 
L 224.472436 243.06016 
L 228.368291 245.78114 
L 232.264145 248.841995 
L 236.16 252.173252 
L 241.354473 256.904205 
L 255.639273 270.123088 
L 259.535127 273.398775 
L 263.430982 276.387512 
L 267.326836 279.021466 
L 269.924073 280.550437 
L 272.521309 281.879524 
L 275.118545 282.995305 
L 277.715782 283.886512 
L 280.313018 284.544147 
L 282.910255 284.961569 
L 285.507491 285.134563 
L 288.104727 285.061381 
L 290.701964 284.742764 
L 293.2992 284.181927 
L 295.896436 283.384535 
L 298.493673 282.358639 
L 301.090909 281.114599 
L 303.688145 279.664978 
L 306.285382 278.024413 
L 310.181236 275.242272 
L 314.077091 272.13134 
L 319.271564 267.594892 
L 325.764655 261.559436 
L 334.854982 253.111078 
L 340.049455 248.640922 
L 343.945309 245.599454 
L 347.841164 242.901983 
L 350.4384 241.325377 
L 353.035636 239.94498 
L 355.632873 238.77473 
L 358.230109 237.826445 
L 360.827345 237.109701 
L 363.424582 236.631735 
L 366.021818 236.397373 
L 368.619055 236.408983 
L 371.216291 236.666447 
L 373.813527 237.167165 
L 376.410764 237.906081 
L 379.008 238.875734 
L 381.605236 240.066331 
L 384.202473 241.465851 
L 386.799709 243.06016 
L 390.695564 245.78114 
L 394.591418 248.841995 
L 398.487273 252.173252 
L 398.487273 252.173252 
" clip-path="url(#p717908bc63)" style="fill: none; stroke: #2ca02c; stroke-width: 1.5; stroke-linecap: square"/>
   </g>
   <g id="line2d_30">
    <path d="M 73.832727 125.415795 
L 76.429964 129.574168 
L 79.0272 134.417212 
L 81.624436 139.896025 
L 84.221673 145.955279 
L 86.818909 152.53379 
L 90.714764 163.228577 
L 94.610618 174.698417 
L 99.805091 190.745431 
L 108.895418 219.074883 
L 112.791273 230.597668 
L 116.687127 241.366463 
L 119.284364 248.005204 
L 121.8816 254.132703 
L 124.478836 259.687087 
L 127.076073 264.612268 
L 129.673309 268.85851 
L 132.270545 272.382936 
L 133.569164 273.863051 
L 134.867782 275.149956 
L 136.1664 276.2404 
L 137.465018 277.131629 
L 138.763636 277.82139 
L 140.062255 278.307943 
L 141.360873 278.590058 
L 142.659491 278.667021 
L 143.958109 278.53864 
L 145.256727 278.205237 
L 146.555345 277.667655 
L 147.853964 276.927253 
L 149.152582 275.9859 
L 150.4512 274.845975 
L 151.749818 273.510357 
L 153.048436 271.98242 
L 155.645673 268.365502 
L 158.242909 264.031747 
L 160.840145 259.024916 
L 163.437382 253.395567 
L 166.034618 247.200547 
L 168.631855 240.502411 
L 172.527709 229.661046 
L 176.423564 218.08695 
L 182.916655 197.886994 
L 190.708364 173.717504 
L 194.604218 162.302612 
L 198.500073 151.68379 
L 201.097309 145.166766 
L 203.694545 139.17696 
L 206.291782 133.774858 
L 208.889018 129.015009 
L 211.486255 124.945479 
L 212.784873 123.182709 
L 214.083491 121.607361 
L 215.382109 120.223414 
L 216.680727 119.034364 
L 217.979345 118.043215 
L 219.277964 117.25247 
L 220.576582 116.664127 
L 221.8752 116.279672 
L 223.173818 116.100076 
L 224.472436 116.125793 
L 225.771055 116.356758 
L 227.069673 116.792388 
L 228.368291 117.431582 
L 229.666909 118.272725 
L 230.965527 119.313692 
L 232.264145 120.551855 
L 233.562764 121.984085 
L 234.861382 123.606765 
L 237.458618 127.406605 
L 240.055855 131.913006 
L 242.653091 137.080461 
L 245.250327 142.85679 
L 247.847564 149.183664 
L 250.4448 155.997194 
L 254.340655 166.978289 
L 258.236509 178.649332 
L 266.028218 202.992046 
L 272.521309 222.983733 
L 276.417164 234.28352 
L 280.313018 244.745662 
L 282.910255 251.136854 
L 285.507491 256.985183 
L 288.104727 262.231592 
L 290.701964 266.823102 
L 293.2992 270.71335 
L 294.597818 272.382936 
L 295.896436 273.863051 
L 297.195055 275.149956 
L 298.493673 276.2404 
L 299.792291 277.131629 
L 301.090909 277.82139 
L 302.389527 278.307943 
L 303.688145 278.590058 
L 304.986764 278.667021 
L 306.285382 278.53864 
L 307.584 278.205237 
L 308.882618 277.667655 
L 310.181236 276.927253 
L 311.479855 275.9859 
L 312.778473 274.845975 
L 314.077091 273.510357 
L 315.375709 271.98242 
L 317.972945 268.365502 
L 320.570182 264.031747 
L 323.167418 259.024916 
L 325.764655 253.395567 
L 328.361891 247.200547 
L 330.959127 240.502411 
L 334.854982 229.661046 
L 338.750836 218.08695 
L 345.243927 197.886994 
L 353.035636 173.717504 
L 356.931491 162.302612 
L 360.827345 151.68379 
L 363.424582 145.166766 
L 366.021818 139.17696 
L 368.619055 133.774858 
L 371.216291 129.015009 
L 373.813527 124.945479 
L 375.112145 123.182709 
L 376.410764 121.607361 
L 377.709382 120.223414 
L 379.008 119.034364 
L 380.306618 118.043215 
L 381.605236 117.25247 
L 382.903855 116.664127 
L 384.202473 116.279672 
L 385.501091 116.100076 
L 386.799709 116.125793 
L 388.098327 116.356758 
L 389.396945 116.792388 
L 390.695564 117.431582 
L 391.994182 118.272725 
L 393.2928 119.313692 
L 394.591418 120.551855 
L 395.890036 121.984085 
L 397.188655 123.606765 
L 398.487273 125.415795 
L 398.487273 125.415795 
" clip-path="url(#p717908bc63)" style="fill: none; stroke: #d62728; stroke-width: 1.5; stroke-linecap: square"/>
   </g>
   <g id="patch_3">
    <path d="M 57.6 307.584 
L 57.6 41.472 
" style="fill: none; stroke: #000000; stroke-width: 0.8; stroke-linejoin: miter; stroke-linecap: square"/>
   </g>
   <g id="patch_4">
    <path d="M 414.72 307.584 
L 414.72 41.472 
" style="fill: none; stroke: #000000; stroke-width: 0.8; stroke-linejoin: miter; stroke-linecap: square"/>
   </g>
   <g id="patch_5">
    <path d="M 57.6 307.584 
L 414.72 307.584 
" style="fill: none; stroke: #000000; stroke-width: 0.8; stroke-linejoin: miter; stroke-linecap: square"/>
   </g>
   <g id="patch_6">
    <path d="M 57.6 41.472 
L 414.72 41.472 
" style="fill: none; stroke: #000000; stroke-width: 0.8; stroke-linejoin: miter; stroke-linecap: square"/>
   </g>
   <g id="text_16">
    <!-- $\theta_{0}$ = 20.0$^{\circ}$ -->
    <g transform="translate(204.6 35.472) scale(0.12 -0.12)">
     <defs>
      <path id="DejaVuSans-Oblique-3b8" d="M 2913 2219 
L 925 2219 
Q 791 1284 928 888 
Q 1100 400 1566 400 
Q 2034 400 2391 891 
Q 2703 1322 2913 2219 
z
M 3009 2750 
Q 3094 3638 2984 3950 
Q 2813 4444 2353 4444 
Q 1875 4444 1525 3956 
Q 1250 3563 1034 2750 
L 3009 2750 
z
M 2444 4913 
Q 3194 4913 3494 4250 
Q 3794 3591 3566 2422 
Q 3341 1256 2781 594 
Q 2225 -72 1475 -72 
Q 722 -72 425 594 
Q 128 1256 353 2422 
Q 581 3591 1134 4250 
Q 1691 4913 2444 4913 
z
" transform="scale(0.015625)"/>
      <path id="DejaVuSans-3d" d="M 678 2906 
L 4684 2906 
L 4684 2381 
L 678 2381 
L 678 2906 
z
M 678 1631 
L 4684 1631 
L 4684 1100 
L 678 1100 
L 678 1631 
z
" transform="scale(0.015625)"/>
      <path id="DejaVuSans-2218" d="M 2003 2603 
Q 1753 2603 1581 2429 
Q 1409 2256 1409 2006 
Q 1409 1759 1581 1589 
Q 1753 1419 2003 1419 
Q 2253 1419 2425 1589 
Q 2597 1759 2597 2006 
Q 2597 2253 2423 2428 
Q 2250 2603 2003 2603 
z
M 2003 3006 
Q 2203 3006 2387 2929 
Q 2572 2853 2706 2709 
Q 2850 2569 2922 2390 
Q 2994 2212 2994 2006 
Q 2994 1594 2705 1308 
Q 2416 1022 1997 1022 
Q 1575 1022 1294 1303 
Q 1013 1584 1013 2006 
Q 1013 2425 1300 2715 
Q 1588 3006 2003 3006 
z
" transform="scale(0.015625)"/>
     </defs>
     <use xlink:href="#DejaVuSans-Oblique-3b8" transform="translate(0 0.234375)"/>
     <use xlink:href="#DejaVuSans-30" transform="translate(61.181641 -16.171875) scale(0.7)"/>
     <use xlink:href="#DejaVuSans-20" transform="translate(108.452148 0.234375)"/>
     <use xlink:href="#DejaVuSans-3d" transform="translate(140.239258 0.234375)"/>
     <use xlink:href="#DejaVuSans-20" transform="translate(224.02832 0.234375)"/>
     <use xlink:href="#DejaVuSans-32" transform="translate(255.81543 0.234375)"/>
     <use xlink:href="#DejaVuSans-30" transform="translate(319.438477 0.234375)"/>
     <use xlink:href="#DejaVuSans-2e" transform="translate(383.061523 0.234375)"/>
     <use xlink:href="#DejaVuSans-30" transform="translate(414.848633 0.234375)"/>
     <use xlink:href="#DejaVuSans-2218" transform="translate(479.428711 38.515625) scale(0.7)"/>
    </g>
   </g>
   <g id="legend_1">
    <g id="patch_7">
     <path d="M 246.590312 108.1845 
L 407.72 108.1845 
Q 409.72 108.1845 409.72 106.1845 
L 409.72 48.472 
Q 409.72 46.472 407.72 46.472 
L 246.590312 46.472 
Q 244.590312 46.472 244.590312 48.472 
L 244.590312 106.1845 
Q 244.590312 108.1845 246.590312 108.1845 
z
" style="fill: #ffffff; opacity: 0.8; stroke: #cccccc; stroke-linejoin: miter"/>
    </g>
    <g id="line2d_31">
     <path d="M 248.590312 54.570438 
L 258.590312 54.570438 
L 268.590312 54.570438 
" style="fill: none; stroke: #1f77b4; stroke-width: 1.5; stroke-linecap: square"/>
    </g>
    <g id="text_17">
     <!-- Drag Power -->
     <g transform="translate(276.590312 58.070438) scale(0.1 -0.1)">
      <defs>
       <path id="DejaVuSans-61" d="M 2194 1759 
Q 1497 1759 1228 1600 
Q 959 1441 959 1056 
Q 959 750 1161 570 
Q 1363 391 1709 391 
Q 2188 391 2477 730 
Q 2766 1069 2766 1631 
L 2766 1759 
L 2194 1759 
z
M 3341 1997 
L 3341 0 
L 2766 0 
L 2766 531 
Q 2569 213 2275 61 
Q 1981 -91 1556 -91 
Q 1019 -91 701 211 
Q 384 513 384 1019 
Q 384 1609 779 1909 
Q 1175 2209 1959 2209 
L 2766 2209 
L 2766 2266 
Q 2766 2663 2505 2880 
Q 2244 3097 1772 3097 
Q 1472 3097 1187 3025 
Q 903 2953 641 2809 
L 641 3341 
Q 956 3463 1253 3523 
Q 1550 3584 1831 3584 
Q 2591 3584 2966 3190 
Q 3341 2797 3341 1997 
z
" transform="scale(0.015625)"/>
       <path id="DejaVuSans-67" d="M 2906 1791 
Q 2906 2416 2648 2759 
Q 2391 3103 1925 3103 
Q 1463 3103 1205 2759 
Q 947 2416 947 1791 
Q 947 1169 1205 825 
Q 1463 481 1925 481 
Q 2391 481 2648 825 
Q 2906 1169 2906 1791 
z
M 3481 434 
Q 3481 -459 3084 -895 
Q 2688 -1331 1869 -1331 
Q 1566 -1331 1297 -1286 
Q 1028 -1241 775 -1147 
L 775 -588 
Q 1028 -725 1275 -790 
Q 1522 -856 1778 -856 
Q 2344 -856 2625 -561 
Q 2906 -266 2906 331 
L 2906 616 
Q 2728 306 2450 153 
Q 2172 0 1784 0 
Q 1141 0 747 490 
Q 353 981 353 1791 
Q 353 2603 747 3093 
Q 1141 3584 1784 3584 
Q 2172 3584 2450 3431 
Q 2728 3278 2906 2969 
L 2906 3500 
L 3481 3500 
L 3481 434 
z
" transform="scale(0.015625)"/>
      </defs>
      <use xlink:href="#DejaVuSans-44"/>
      <use xlink:href="#DejaVuSans-72" x="77.001953"/>
      <use xlink:href="#DejaVuSans-61" x="118.115234"/>
      <use xlink:href="#DejaVuSans-67" x="179.394531"/>
      <use xlink:href="#DejaVuSans-20" x="242.871094"/>
      <use xlink:href="#DejaVuSans-50" x="274.658203"/>
      <use xlink:href="#DejaVuSans-6f" x="331.335938"/>
      <use xlink:href="#DejaVuSans-77" x="392.517578"/>
      <use xlink:href="#DejaVuSans-65" x="474.304688"/>
      <use xlink:href="#DejaVuSans-72" x="535.828125"/>
     </g>
    </g>
    <g id="line2d_32">
     <path d="M 248.590312 69.248563 
L 258.590312 69.248563 
L 268.590312 69.248563 
" style="fill: none; stroke: #ff7f0e; stroke-width: 1.5; stroke-linecap: square"/>
    </g>
    <g id="text_18">
     <!-- Heaving Power -->
     <g transform="translate(276.590312 72.748563) scale(0.1 -0.1)">
      <defs>
       <path id="DejaVuSans-48" d="M 628 4666 
L 1259 4666 
L 1259 2753 
L 3553 2753 
L 3553 4666 
L 4184 4666 
L 4184 0 
L 3553 0 
L 3553 2222 
L 1259 2222 
L 1259 0 
L 628 0 
L 628 4666 
z
" transform="scale(0.015625)"/>
       <path id="DejaVuSans-76" d="M 191 3500 
L 800 3500 
L 1894 563 
L 2988 3500 
L 3597 3500 
L 2284 0 
L 1503 0 
L 191 3500 
z
" transform="scale(0.015625)"/>
      </defs>
      <use xlink:href="#DejaVuSans-48"/>
      <use xlink:href="#DejaVuSans-65" x="75.195312"/>
      <use xlink:href="#DejaVuSans-61" x="136.71875"/>
      <use xlink:href="#DejaVuSans-76" x="197.998047"/>
      <use xlink:href="#DejaVuSans-69" x="257.177734"/>
      <use xlink:href="#DejaVuSans-6e" x="284.960938"/>
      <use xlink:href="#DejaVuSans-67" x="348.339844"/>
      <use xlink:href="#DejaVuSans-20" x="411.816406"/>
      <use xlink:href="#DejaVuSans-50" x="443.603516"/>
      <use xlink:href="#DejaVuSans-6f" x="500.28125"/>
      <use xlink:href="#DejaVuSans-77" x="561.462891"/>
      <use xlink:href="#DejaVuSans-65" x="643.25"/>
      <use xlink:href="#DejaVuSans-72" x="704.773438"/>
     </g>
    </g>
    <g id="line2d_33">
     <path d="M 248.590312 83.926688 
L 258.590312 83.926688 
L 268.590312 83.926688 
" style="fill: none; stroke: #2ca02c; stroke-width: 1.5; stroke-linecap: square"/>
    </g>
    <g id="text_19">
     <!-- Pitching Power -->
     <g transform="translate(276.590312 87.426688) scale(0.1 -0.1)">
      <defs>
       <path id="DejaVuSans-74" d="M 1172 4494 
L 1172 3500 
L 2356 3500 
L 2356 3053 
L 1172 3053 
L 1172 1153 
Q 1172 725 1289 603 
Q 1406 481 1766 481 
L 2356 481 
L 2356 0 
L 1766 0 
Q 1100 0 847 248 
Q 594 497 594 1153 
L 594 3053 
L 172 3053 
L 172 3500 
L 594 3500 
L 594 4494 
L 1172 4494 
z
" transform="scale(0.015625)"/>
       <path id="DejaVuSans-63" d="M 3122 3366 
L 3122 2828 
Q 2878 2963 2633 3030 
Q 2388 3097 2138 3097 
Q 1578 3097 1268 2742 
Q 959 2388 959 1747 
Q 959 1106 1268 751 
Q 1578 397 2138 397 
Q 2388 397 2633 464 
Q 2878 531 3122 666 
L 3122 134 
Q 2881 22 2623 -34 
Q 2366 -91 2075 -91 
Q 1284 -91 818 406 
Q 353 903 353 1747 
Q 353 2603 823 3093 
Q 1294 3584 2113 3584 
Q 2378 3584 2631 3529 
Q 2884 3475 3122 3366 
z
" transform="scale(0.015625)"/>
       <path id="DejaVuSans-68" d="M 3513 2113 
L 3513 0 
L 2938 0 
L 2938 2094 
Q 2938 2591 2744 2837 
Q 2550 3084 2163 3084 
Q 1697 3084 1428 2787 
Q 1159 2491 1159 1978 
L 1159 0 
L 581 0 
L 581 4863 
L 1159 4863 
L 1159 2956 
Q 1366 3272 1645 3428 
Q 1925 3584 2291 3584 
Q 2894 3584 3203 3211 
Q 3513 2838 3513 2113 
z
" transform="scale(0.015625)"/>
      </defs>
      <use xlink:href="#DejaVuSans-50"/>
      <use xlink:href="#DejaVuSans-69" x="58.052734"/>
      <use xlink:href="#DejaVuSans-74" x="85.835938"/>
      <use xlink:href="#DejaVuSans-63" x="125.044922"/>
      <use xlink:href="#DejaVuSans-68" x="180.025391"/>
      <use xlink:href="#DejaVuSans-69" x="243.404297"/>
      <use xlink:href="#DejaVuSans-6e" x="271.1875"/>
      <use xlink:href="#DejaVuSans-67" x="334.566406"/>
      <use xlink:href="#DejaVuSans-20" x="398.042969"/>
      <use xlink:href="#DejaVuSans-50" x="429.830078"/>
      <use xlink:href="#DejaVuSans-6f" x="486.507812"/>
      <use xlink:href="#DejaVuSans-77" x="547.689453"/>
      <use xlink:href="#DejaVuSans-65" x="629.476562"/>
      <use xlink:href="#DejaVuSans-72" x="691"/>
     </g>
    </g>
    <g id="line2d_34">
     <path d="M 248.590312 98.604813 
L 258.590312 98.604813 
L 268.590312 98.604813 
" style="fill: none; stroke: #d62728; stroke-width: 1.5; stroke-linecap: square"/>
    </g>
    <g id="text_20">
     <!-- Heaving + Pitching Power -->
     <g transform="translate(276.590312 102.104813) scale(0.1 -0.1)">
      <defs>
       <path id="DejaVuSans-2b" d="M 2944 4013 
L 2944 2272 
L 4684 2272 
L 4684 1741 
L 2944 1741 
L 2944 0 
L 2419 0 
L 2419 1741 
L 678 1741 
L 678 2272 
L 2419 2272 
L 2419 4013 
L 2944 4013 
z
" transform="scale(0.015625)"/>
      </defs>
      <use xlink:href="#DejaVuSans-48"/>
      <use xlink:href="#DejaVuSans-65" x="75.195312"/>
      <use xlink:href="#DejaVuSans-61" x="136.71875"/>
      <use xlink:href="#DejaVuSans-76" x="197.998047"/>
      <use xlink:href="#DejaVuSans-69" x="257.177734"/>
      <use xlink:href="#DejaVuSans-6e" x="284.960938"/>
      <use xlink:href="#DejaVuSans-67" x="348.339844"/>
      <use xlink:href="#DejaVuSans-20" x="411.816406"/>
      <use xlink:href="#DejaVuSans-2b" x="443.603516"/>
      <use xlink:href="#DejaVuSans-20" x="527.392578"/>
      <use xlink:href="#DejaVuSans-50" x="559.179688"/>
      <use xlink:href="#DejaVuSans-69" x="617.232422"/>
      <use xlink:href="#DejaVuSans-74" x="645.015625"/>
      <use xlink:href="#DejaVuSans-63" x="684.224609"/>
      <use xlink:href="#DejaVuSans-68" x="739.205078"/>
      <use xlink:href="#DejaVuSans-69" x="802.583984"/>
      <use xlink:href="#DejaVuSans-6e" x="830.367188"/>
      <use xlink:href="#DejaVuSans-67" x="893.746094"/>
      <use xlink:href="#DejaVuSans-20" x="957.222656"/>
      <use xlink:href="#DejaVuSans-50" x="989.009766"/>
      <use xlink:href="#DejaVuSans-6f" x="1045.6875"/>
      <use xlink:href="#DejaVuSans-77" x="1106.869141"/>
      <use xlink:href="#DejaVuSans-65" x="1188.65625"/>
      <use xlink:href="#DejaVuSans-72" x="1250.179688"/>
     </g>
    </g>
   </g>
  </g>
 </g>
 <defs>
  <clipPath id="p717908bc63">
   <rect x="57.6" y="41.472" width="357.12" height="266.112"/>
  </clipPath>
 </defs>
</svg>
