openmpi/4.0.0-gcc8.2(19):ERROR:150: Module 'openmpi/4.0.0-gcc8.2' conflicts with the currently loaded module(s) 'openmpi/4.1.6-gcc8.2'
openmpi/4.0.0-gcc8.2(19):ERROR:102: Tcl command execution failed: conflict                               intel openmpi

--------------------------------------------------------------------------
By default, for Open MPI 4.0 and later, infiniband ports on a device
are not used by default.  The intent is to use UCX for these devices.
You can override this policy by setting the btl_openib_allow_ib MCA parameter
to true.

  Local host:              bigmem08
  Local adapter:           hfi1_0
  Local port:              1

--------------------------------------------------------------------------
--------------------------------------------------------------------------
WARNING: There was an error initializing an OpenFabrics device.

  Local host:   bigmem08
  Local device: hfi1_0
--------------------------------------------------------------------------
--------------------------------------------------------------------------
Primary job  terminated normally, but 1 process returned
a non-zero exit code. Per user-direction, the job has been aborted.
--------------------------------------------------------------------------
--------------------------------------------------------------------------
mpiexec detected that one or more processes exited with non-zero status, thus causing
the job to be terminated. The first process to do so was:

  Process name: [[40121,1],0]
  Exit code:    8
--------------------------------------------------------------------------
