openmpi/4.0.0-gcc8.2(19):ERROR:150: Module 'openmpi/4.0.0-gcc8.2' conflicts with the currently loaded module(s) 'openmpi/4.1.6-gcc8.2'
openmpi/4.0.0-gcc8.2(19):ERROR:102: Tcl command execution failed: conflict                               intel openmpi

--------------------------------------------------------------------------
By default, for Open MPI 4.0 and later, infiniband ports on a device
are not used by default.  The intent is to use UCX for these devices.
You can override this policy by setting the btl_openib_allow_ib MCA parameter
to true.

  Local host:              node054
  Local adapter:           hfi1_0
  Local port:              1

--------------------------------------------------------------------------
--------------------------------------------------------------------------
WARNING: There was an error initializing an OpenFabrics device.

  Local host:   node054
  Local device: hfi1_0
--------------------------------------------------------------------------
