[ { "header": "Split", "tactic": "Wp.split", "params": {},
    "select": { "select": "inside-step", "at": 5, "kind": "have", "occur": 0,
                "target": "(separated rm_0 9 q_0 4)",
                "pattern": "separated$rm9$q4" },
    "children": { "True": [ { "header": "Separated",
                              "tactic": "Wp.separated", "params": {},
                              "select": { "select": "clause-step", "at": 5,
                                          "kind": "have",
                                          "target": "(separated rm_0 9 q_0 4)",
                                          "pattern": "separated$rm9$q4" },
                              "children": { "WrongBase": [ { "prover": "CVC4:1.9-prerelease:strings+counterexamples",
                                                             "verdict": "valid",
                                                             "time": 3.84 } ],
                                            "OnLeft": [ { "prover": "CVC4:1.9-prerelease:strings+counterexamples",
                                                          "verdict": "valid",
                                                          "time": 5.57 } ],
                                            "OnRight": [ { "prover": "CVC4:1.9-prerelease:strings+counterexamples",
                                                           "verdict": "valid",
                                                           "time": 5.8 } ],
                                            "OverLap": [ { "prover": "qed",
                                                           "verdict": "valid" } ] } } ],
                  "False": [ { "prover": "qed", "verdict": "valid" } ] } } ]
