[ { "header": "Definition", "tactic": "Wp.unfold", "params": {},
    "select": { "select": "clause-goal",
                "target": "let a_0 = (shiftfield_F6_FloatRMat_m rm_0) in\nlet r_0 = Mf32_1[(shiftfield_F4_FloatQuat_qi q_0)] in\nlet r_1 = (2*r_0*r_0) in\nlet r_2 = Mf32_1[(shiftfield_F4_FloatQuat_qx q_0)] in\nlet r_3 = Mf32_1[(shiftfield_F4_FloatQuat_qz q_0)] in\nlet r_4 = (2*r_0*r_3) in\nlet r_5 = Mf32_1[(shiftfield_F4_FloatQuat_qy q_0)] in\nlet r_6 = (2*r_2*r_5) in\nlet r_7 = (2*r_0*r_5) in\nlet r_8 = (2*r_2*r_3) in\nlet r_9 = (2*r_0*r_2) in\nlet r_10 = (2*r_5*r_3) in\n(P_rotation_matrix\n  (L_l_RMat_of_FloatRMat\n    Mf32_1[(shift_float32 a_0 0)->r_1+(2*r_2*r_2)-1][(shift_float32 a_0 1)\n      ->r_4+r_6][(shift_float32 a_0 2)->r_8-r_7][(shift_float32 a_0 3)\n      ->r_6-r_4][(shift_float32 a_0 4)->r_1+(2*r_5*r_5)-1]\n      [(shift_float32 a_0 5)->r_9+r_10][(shift_float32 a_0 6)->r_7+r_8]\n      [(shift_float32 a_0 7)->r_10-r_9][(shift_float32 a_0 8)\n      ->r_1+(2*r_3*r_3)-1] rm_0))",
                "pattern": "P_rotation_matrixL_l_RMat_of_FloatRMat" },
    "children": { "Unfold 'P_rotation_matrix'": [ { "header": "Definition",
                                                    "tactic": "Wp.unfold",
                                                    "params": {},
                                                    "select": { "select": "inside-goal",
                                                                "occur": 0,
                                                                "target": "let a_0 = (shiftfield_F6_FloatRMat_m rm_0) in\nlet r_0 = Mf32_1[(shiftfield_F4_FloatQuat_qi q_0)] in\nlet r_1 = (2*r_0*r_0) in\nlet r_2 = Mf32_1[(shiftfield_F4_FloatQuat_qx q_0)] in\nlet r_3 = Mf32_1[(shiftfield_F4_FloatQuat_qz q_0)] in\nlet r_4 = (2*r_0*r_3) in\nlet r_5 = Mf32_1[(shiftfield_F4_FloatQuat_qy q_0)] in\nlet r_6 = (2*r_2*r_5) in\nlet r_7 = (2*r_0*r_5) in\nlet r_8 = (2*r_2*r_3) in\nlet r_9 = (2*r_0*r_2) in\nlet r_10 = (2*r_5*r_3) in\n(L_transpose\n  (L_l_RMat_of_FloatRMat\n    Mf32_1[(shift_float32 a_0 0)->r_1+(2*r_2*r_2)-1][(shift_float32 a_0 1)\n      ->r_4+r_6][(shift_float32 a_0 2)->r_8-r_7][(shift_float32 a_0 3)\n      ->r_6-r_4][(shift_float32 a_0 4)->r_1+(2*r_5*r_5)-1]\n      [(shift_float32 a_0 5)->r_9+r_10][(shift_float32 a_0 6)->r_7+r_8]\n      [(shift_float32 a_0 7)->r_10-r_9][(shift_float32 a_0 8)\n      ->r_1+(2*r_3*r_3)-1] rm_0))",
                                                                "pattern": "L_transposeL_l_RMat_of_FloatRMat" },
                                                    "children": { "Unfold 'L_transpose'": 
                                                                    [ { "header": "Definition",
                                                                    "tactic": "Wp.unfold",
                                                                    "params": {},
                                                                    "select": 
                                                                    { "select": "inside-goal",
                                                                    "occur": 0,
                                                                    "target": "let a_0 = (shiftfield_F6_FloatRMat_m rm_0) in\nlet r_0 = Mf32_1[(shiftfield_F4_FloatQuat_qi q_0)] in\nlet r_1 = (2*r_0*r_0) in\nlet r_2 = Mf32_1[(shiftfield_F4_FloatQuat_qx q_0)] in\nlet r_3 = Mf32_1[(shiftfield_F4_FloatQuat_qz q_0)] in\nlet r_4 = (2*r_0*r_3) in\nlet r_5 = Mf32_1[(shiftfield_F4_FloatQuat_qy q_0)] in\nlet r_6 = (2*r_2*r_5) in\nlet r_7 = (2*r_0*r_5) in\nlet r_8 = (2*r_2*r_3) in\nlet r_9 = (2*r_0*r_2) in\nlet r_10 = (2*r_5*r_3) in\nlet a_1 =\n    (L_l_RMat_of_FloatRMat\n      Mf32_1[(shift_float32 a_0 0)->r_1+(2*r_2*r_2)-1][(shift_float32 a_0 1)\n        ->r_4+r_6][(shift_float32 a_0 2)->r_8-r_7][(shift_float32 a_0 3)\n        ->r_6-r_4][(shift_float32 a_0 4)->r_1+(2*r_5*r_5)-1]\n        [(shift_float32 a_0 5)->r_9+r_10][(shift_float32 a_0 6)->r_7+r_8]\n        [(shift_float32 a_0 7)->r_10-r_9][(shift_float32 a_0 8)\n        ->r_1+(2*r_3*r_3)-1] rm_0) in\n(L_mult_RealRMat a_1\n  {\n     a_1 with\n     F13_RealRMat_s_a01 = a_1.F13_RealRMat_s_a10 ;\n     F13_RealRMat_s_a02 = a_1.F13_RealRMat_s_a20 ;\n     F13_RealRMat_s_a10 = a_1.F13_RealRMat_s_a01 ;\n     F13_RealRMat_s_a12 = a_1.F13_RealRMat_s_a21 ;\n     F13_RealRMat_s_a20 = a_1.F13_RealRMat_s_a02 ;\n     F13_RealRMat_s_a21 = a_1.F13_RealRMat_s_a12\n  })",
                                                                    "pattern": "L_mult_RealRMatL_l_RMat_of_FloatRMat" },
                                                                    "children": 
                                                                    { "Unfold 'L_mult_RealRMat'": 
                                                                    [ { "header": "Definition",
                                                                    "tactic": "Wp.unfold",
                                                                    "params": {},
                                                                    "select": 
                                                                    { "select": "inside-goal",
                                                                    "occur": 0,
                                                                    "target": "L_id_rmat",
                                                                    "pattern": "L_id_rmat" },
                                                                    "children": 
                                                                    { "Unfold 'L_id_rmat'": 
                                                                    [ { "header": "Definition",
                                                                    "tactic": "Wp.unfold",
                                                                    "params": {},
                                                                    "select": 
                                                                    { "select": "clause-goal",
                                                                    "target": "let a_0 = (shiftfield_F6_FloatRMat_m rm_0) in\nlet r_0 = Mf32_1[(shiftfield_F4_FloatQuat_qi q_0)] in\nlet r_1 = (2*r_0*r_0) in\nlet r_2 = Mf32_1[(shiftfield_F4_FloatQuat_qx q_0)] in\nlet r_3 = Mf32_1[(shiftfield_F4_FloatQuat_qz q_0)] in\nlet r_4 = (2*r_0*r_3) in\nlet r_5 = Mf32_1[(shiftfield_F4_FloatQuat_qy q_0)] in\nlet r_6 = (2*r_2*r_5) in\nlet r_7 = (2*r_0*r_5) in\nlet r_8 = (2*r_2*r_3) in\nlet r_9 = (2*r_0*r_2) in\nlet r_10 = (2*r_5*r_3) in\nlet a_1 =\n    (L_l_RMat_of_FloatRMat\n      Mf32_1[(shift_float32 a_0 0)->r_1+(2*r_2*r_2)-1][(shift_float32 a_0 1)\n        ->r_4+r_6][(shift_float32 a_0 2)->r_8-r_7][(shift_float32 a_0 3)\n        ->r_6-r_4][(shift_float32 a_0 4)->r_1+(2*r_5*r_5)-1]\n        [(shift_float32 a_0 5)->r_9+r_10][(shift_float32 a_0 6)->r_7+r_8]\n        [(shift_float32 a_0 7)->r_10-r_9][(shift_float32 a_0 8)\n        ->r_1+(2*r_3*r_3)-1] rm_0) in\nlet r_11 = a_1.F13_RealRMat_s_a00 in\nlet r_12 = a_1.F13_RealRMat_s_a01 in\nlet r_13 = a_1.F13_RealRMat_s_a02 in\nlet r_14 = a_1.F13_RealRMat_s_a10 in\nlet r_15 = a_1.F13_RealRMat_s_a11 in\nlet r_16 = a_1.F13_RealRMat_s_a12 in\nlet r_17 = ((r_11*r_14)+(r_12*r_15)+(r_13*r_16)) in\nlet r_18 = a_1.F13_RealRMat_s_a20 in\nlet r_19 = a_1.F13_RealRMat_s_a21 in\nlet r_20 = a_1.F13_RealRMat_s_a22 in\nlet r_21 = ((r_11*r_18)+(r_12*r_19)+(r_13*r_20)) in\nlet r_22 = ((r_14*r_18)+(r_15*r_19)+(r_16*r_20)) in\n(EqS13_RealRMat_s\n  {\n     F13_RealRMat_s_a00 = (r_11*r_11)+(r_12*r_12)+(r_13*r_13) ;\n     F13_RealRMat_s_a01 = r_17 ;\n     F13_RealRMat_s_a02 = r_21 ;\n     F13_RealRMat_s_a10 = r_17 ;\n     F13_RealRMat_s_a11 = (r_14*r_14)+(r_15*r_15)+(r_16*r_16) ;\n     F13_RealRMat_s_a12 = r_22 ;\n     F13_RealRMat_s_a20 = r_21 ;\n     F13_RealRMat_s_a21 = r_22 ;\n     F13_RealRMat_s_a22 = (r_18*r_18)+(r_19*r_19)+(r_20*r_20)\n  }\n  {\n     F13_RealRMat_s_a00 = 1 ;\n     F13_RealRMat_s_a01 = 0 ;\n     F13_RealRMat_s_a02 = 0 ;\n     F13_RealRMat_s_a10 = 0 ;\n     F13_RealRMat_s_a11 = 1 ;\n     F13_RealRMat_s_a12 = 0 ;\n     F13_RealRMat_s_a20 = 0 ;\n     F13_RealRMat_s_a21 = 0 ;\n     F13_RealRMat_s_a22 = 1\n  })",
                                                                    "pattern": "EqS13_RealRMat_s{RealRMat_s}{RealRMat_s}" },
                                                                    "children": 
                                                                    { "Unfold 'EqS13_RealRMat_s'": 
                                                                    [ { "header": "Definition",
                                                                    "tactic": "Wp.unfold",
                                                                    "params": {},
                                                                    "select": 
                                                                    { "select": "inside-goal",
                                                                    "occur": 0,
                                                                    "target": "let a_0 = (shiftfield_F6_FloatRMat_m rm_0) in\nlet r_0 = Mf32_1[(shiftfield_F4_FloatQuat_qi q_0)] in\nlet r_1 = (2*r_0*r_0) in\nlet r_2 = Mf32_1[(shiftfield_F4_FloatQuat_qx q_0)] in\nlet r_3 = Mf32_1[(shiftfield_F4_FloatQuat_qz q_0)] in\nlet r_4 = (2*r_0*r_3) in\nlet r_5 = Mf32_1[(shiftfield_F4_FloatQuat_qy q_0)] in\nlet r_6 = (2*r_2*r_5) in\nlet r_7 = (2*r_0*r_5) in\nlet r_8 = (2*r_2*r_3) in\nlet r_9 = (2*r_0*r_2) in\nlet r_10 = (2*r_5*r_3) in\n(L_l_RMat_of_FloatRMat\n  Mf32_1[(shift_float32 a_0 0)->r_1+(2*r_2*r_2)-1][(shift_float32 a_0 1)\n    ->r_4+r_6][(shift_float32 a_0 2)->r_8-r_7][(shift_float32 a_0 3)\n    ->r_6-r_4][(shift_float32 a_0 4)->r_1+(2*r_5*r_5)-1]\n    [(shift_float32 a_0 5)->r_9+r_10][(shift_float32 a_0 6)->r_7+r_8]\n    [(shift_float32 a_0 7)->r_10-r_9][(shift_float32 a_0 8)\n    ->r_1+(2*r_3*r_3)-1] rm_0)",
                                                                    "pattern": "L_l_RMat_of_FloatRMat[=]$rm[=]shift_float32" },
                                                                    "children": 
                                                                    { "Unfold 'L_l_RMat_of_FloatRMat'": 
                                                                    [ { "header": "Definition",
                                                                    "tactic": "Wp.unfold",
                                                                    "params": {},
                                                                    "select": 
                                                                    { "select": "inside-step",
                                                                    "at": 4,
                                                                    "kind": "have",
                                                                    "occur": 0,
                                                                    "target": "(P_unitary_quaternion_1_ Mf32_1 q_0)",
                                                                    "pattern": "P_unitary_quaternion_1_$Mf32$q" },
                                                                    "children": 
                                                                    { "Unfold 'P_unitary_quaternion_1_'": 
                                                                    [ { "prover": "Alt-Ergo:2.4.0",
                                                                    "verdict": "valid",
                                                                    "time": 5.852,
                                                                    "steps": 20761 } ] } } ] } } ] } } ] } } ] } } ] } } ] } } ]
