[ { "header": "Logical Shift", "tactic": "Wp.shift", "params": {},
    "select": { "select": "inside-goal", "occur": 0,
                "target": "let a_0 = (shiftfield_F15_Int32RMat_m r_3) in\n(lsl\n  (to_sint32\n    (\\truncate\n      (16384+\n       (real_of_int\n         (Mint_3[(shift_sint32 a_0 8)]-Mint_3[(shift_sint32 a_0 0)]-\n          Mint_3[(shift_sint32 a_0 4)]))))) 14)",
                "pattern": "lslto_sint3214\\truncate+16384real_of_int" },
    "children": { "shift": [ { "prover": "CVC4:1.9-prerelease:strings+counterexamples",
                               "verdict": "valid", "time": 0.69 } ] } } ]
