[ { "header": "Definition", "tactic": "Wp.unfold", "params": {},
    "select": { "select": "inside-step", "at": 3, "kind": "have", "occur": 0,
                "target": "(P_valid_bound_Int32Quat Malloc_0 Mint_15 q_2 32768)",
                "pattern": "P_valid_bound_Int32Quat$Malloc$Mint" },
    "children": { "Unfold 'P_valid_bound_Int32Quat'": [ { "prover": "Alt-Ergo:2.3.3",
                                                          "verdict": "valid",
                                                          "time": 5.1067,
                                                          "steps": 560 } ] } } ]
