[ { "header": "Logical Shift", "tactic": "Wp.shift", "params": {},
    "select": { "select": "inside-goal", "occur": 0,
                "target": "(lsr (c_psi2_0*pprz_itrig_sin_1) 14)",
                "pattern": "lsr*14$c_psi2$pprz_itrig_sin" },
    "children": { "positive": [ { "prover": "Alt-Ergo:2.3.3",
                                  "verdict": "valid", "time": 0.0433,
                                  "steps": 26 } ],
                  "shift": [ { "header": "Logical Shift",
                               "tactic": "Wp.shift", "params": {},
                               "select": { "select": "inside-goal",
                                           "occur": 0,
                                           "target": "(lsr (c_theta2_0*pprz_itrig_sin_0) 14)",
                                           "pattern": "lsr*14$c_theta2$pprz_itrig_sin" },
                               "children": { "positive": [ { "prover": "Alt-Ergo:2.3.3",
                                                             "verdict": "valid",
                                                             "time": 0.0661,
                                                             "steps": 26 } ],
                                             "shift": [ { "header": "Logical Shift",
                                                          "tactic": "Wp.shift",
                                                          "params": {},
                                                          "select": { "select": "inside-goal",
                                                                    "occur": 0,
                                                                    "target": "(lsr (to_sint32 (c_phi2_0*((c_psi2_0*pprz_itrig_sin_1) div 16384))) 13)",
                                                                    "pattern": "lsrto_sint3213*$c_phi2/*16384$c_psi2" },
                                                          "children": 
                                                            { "positive": 
                                                                [ { "prover": "Alt-Ergo:2.3.3",
                                                                    "verdict": "valid",
                                                                    "time": 0.7394,
                                                                    "steps": 354 } ],
                                                              "shift": 
                                                                [ { "header": "Logical Shift",
                                                                    "tactic": "Wp.shift",
                                                                    "params": {},
                                                                    "select": 
                                                                    { "select": "inside-goal",
                                                                    "occur": 0,
                                                                    "target": "(lsr (to_sint32 (s_phi2_0*((c_theta2_0*pprz_itrig_sin_0) div 16384))) 13)",
                                                                    "pattern": "lsrto_sint3213*$s_phi2/*16384$c_theta2" },
                                                                    "children": 
                                                                    { "positive": 
                                                                    [ { "prover": "Alt-Ergo:2.3.3",
                                                                    "verdict": "valid",
                                                                    "time": 0.6523,
                                                                    "steps": 353 } ],
                                                                    "shift": 
                                                                    [ { "prover": "CVC4:1.9-prerelease:strings+counterexamples",
                                                                    "verdict": "valid",
                                                                    "time": 0.42 } ] } } ] } } ] } } ] } } ]
