[ { "header": "Range", "tactic": "Wp.range",
    "params": { "inf": 0, "sup": 30 },
    "select": { "select": "inside-goal", "occur": 0, "target": "frac_0",
                "pattern": "$frac" },
    "children": { "Lower 0": [ { "prover": "qed", "verdict": "valid" } ],
                  "Value 0": [ { "prover": "qed", "verdict": "valid" } ],
                  "Value 1": [ { "prover": "qed", "verdict": "valid" } ],
                  "Value 2": [ { "prover": "qed", "verdict": "valid" } ],
                  "Value 3": [ { "prover": "qed", "verdict": "valid" } ],
                  "Value 4": [ { "prover": "qed", "verdict": "valid" } ],
                  "Value 5": [ { "prover": "qed", "verdict": "valid" } ],
                  "Value 6": [ { "prover": "qed", "verdict": "valid" } ],
                  "Value 7": [ { "prover": "qed", "verdict": "valid" } ],
                  "Value 8": [ { "prover": "qed", "verdict": "valid" } ],
                  "Value 9": [ { "prover": "qed", "verdict": "valid" } ],
                  "Value 10": [ { "prover": "qed", "verdict": "valid" } ],
                  "Value 11": [ { "prover": "qed", "verdict": "valid" } ],
                  "Value 12": [ { "prover": "qed", "verdict": "valid" } ],
                  "Value 13": [ { "prover": "qed", "verdict": "valid" } ],
                  "Value 14": [ { "prover": "qed", "verdict": "valid" } ],
                  "Value 15": [ { "prover": "qed", "verdict": "valid" } ],
                  "Value 16": [ { "prover": "qed", "verdict": "valid" } ],
                  "Value 17": [ { "prover": "qed", "verdict": "valid" } ],
                  "Value 18": [ { "prover": "qed", "verdict": "valid" } ],
                  "Value 19": [ { "prover": "qed", "verdict": "valid" } ],
                  "Value 20": [ { "prover": "qed", "verdict": "valid" } ],
                  "Value 21": [ { "prover": "qed", "verdict": "valid" } ],
                  "Value 22": [ { "prover": "qed", "verdict": "valid" } ],
                  "Value 23": [ { "prover": "qed", "verdict": "valid" } ],
                  "Value 24": [ { "prover": "qed", "verdict": "valid" } ],
                  "Value 25": [ { "prover": "qed", "verdict": "valid" } ],
                  "Value 26": [ { "prover": "qed", "verdict": "valid" } ],
                  "Value 27": [ { "prover": "qed", "verdict": "valid" } ],
                  "Value 28": [ { "prover": "qed", "verdict": "valid" } ],
                  "Value 29": [ { "prover": "qed", "verdict": "valid" } ],
                  "Value 30": [ { "prover": "qed", "verdict": "valid" } ],
                  "Upper 30": [ { "prover": "qed", "verdict": "valid" } ] } } ]
