[ { "prover": "CVC4:1.9-prerelease:strings+counterexamples",
    "verdict": "timeout", "time": 10. },
  { "prover": "Alt-Ergo:2.3.3", "verdict": "timeout", "time": 10. },
  { "prover": "script", "verdict": "valid" },
  { "header": "Definition", "tactic": "Wp.unfold", "params": {},
    "select": { "select": "inside-step", "at": 3, "kind": "have", "occur": 0,
                "target": "(P_rvalid_bound_Int32Quat Malloc_4 Mint_10 a2b_0 23170)",
                "pattern": "P_rvalid_bound_Int32Quat$Malloc$Mint" },
    "children": { "Unfold 'P_rvalid_bound_Int32Quat'": [ { "prover": "CVC4:1.9-prerelease:strings+counterexamples",
                                                           "verdict": "timeout",
                                                           "time": 10. },
                                                         { "prover": "Alt-Ergo:2.3.3",
                                                           "verdict": "timeout",
                                                           "time": 10. },
                                                         { "header": "Definition",
                                                           "tactic": "Wp.unfold",
                                                           "params": {},
                                                           "select": 
                                                             { "select": "inside-step",
                                                               "at": 3,
                                                               "kind": "have",
                                                               "occur": 0,
                                                               "target": "(P_bound_Int32Quat Mint_10 a2b_0 23170)",
                                                               "pattern": "P_bound_Int32Quat$Mint$a2b23170" },
                                                           "children": 
                                                             { "Unfold 'P_bound_Int32Quat'": 
                                                                 [ { "prover": "CVC4:1.9-prerelease:strings+counterexamples",
                                                                    "verdict": "timeout",
                                                                    "time": 10. },
                                                                   { "prover": "Alt-Ergo:2.3.3",
                                                                    "verdict": "timeout",
                                                                    "time": 10. },
                                                                   { "header": "Definition",
                                                                    "tactic": "Wp.unfold",
                                                                    "params": {},
                                                                    "select": 
                                                                    { "select": "inside-step",
                                                                    "at": 3,
                                                                    "kind": "have",
                                                                    "occur": 0,
                                                                    "target": "(P_rvalid_bound_Int32Quat Malloc_4 Mint_10 b2c_0 23170)",
                                                                    "pattern": "P_rvalid_bound_Int32Quat$Malloc$Mint" },
                                                                    "children": 
                                                                    { "Unfold 'P_rvalid_bound_Int32Quat'": 
                                                                    [ { "prover": "CVC4:1.9-prerelease:strings+counterexamples",
                                                                    "verdict": "timeout",
                                                                    "time": 10. },
                                                                    { "prover": "Alt-Ergo:2.3.3",
                                                                    "verdict": "timeout",
                                                                    "time": 10. },
                                                                    { "header": "Definition",
                                                                    "tactic": "Wp.unfold",
                                                                    "params": {},
                                                                    "select": 
                                                                    { "select": "inside-step",
                                                                    "at": 3,
                                                                    "kind": "have",
                                                                    "occur": 0,
                                                                    "target": "(P_bound_Int32Quat Mint_10 b2c_0 23170)",
                                                                    "pattern": "P_bound_Int32Quat$Mint$b2c23170" },
                                                                    "children": 
                                                                    { "Unfold 'P_bound_Int32Quat'": 
                                                                    [ { "prover": "Alt-Ergo:2.3.3",
                                                                    "verdict": "valid",
                                                                    "time": 4.9917,
                                                                    "steps": 844 } ] } } ] } } ] } } ] } } ]
