[ { "header": "Generic Logical Shift", "tactic": "Wp.gen_shift",
    "params": {},
    "select": { "select": "inside-goal", "occur": 0,
                "target": "(lsr (cphi_0*pprz_itrig_sin_0) 14)",
                "pattern": "lsr*14$cphi$pprz_itrig_sin" },
    "children": { "gen_shift": [ { "header": "Generic Logical Shift",
                                   "tactic": "Wp.gen_shift", "params": {},
                                   "select": { "select": "inside-goal",
                                               "occur": 0,
                                               "target": "(lsr (pprz_itrig_sin_0*pprz_itrig_sin_1) 14)",
                                               "pattern": "lsr*14$pprz_itrig_sin$pprz_itrig_sin" },
                                   "children": { "gen_shift": [ { "prover": "Alt-Ergo:2.3.3",
                                                                  "verdict": "valid",
                                                                  "time": 3.9611,
                                                                  "steps": 1901 } ] } } ] } } ]
