[ { "header": "Filter", "tactic": "Wp.filter", "params": { "anti": false },
    "select": { "select": "inside-step", "at": 5, "kind": "have", "occur": 0,
                "target": "(P_rotation_matrix (L_l_RMat_of_FloatRMat Mf32_1 rm_0))",
                "pattern": "P_rotation_matrixL_l_RMat_of_FloatRMat" },
    "children": { "Filter": [ { "prover": "Alt-Ergo:2.4.0",
                                "verdict": "valid", "time": 6.5365,
                                "steps": 81768 } ] } } ]
