[ { "prover": "Z3:4.8.6:noBV", "verdict": "timeout", "time": 20. },
  { "prover": "Z3:4.8.6:counterexamples", "verdict": "timeout", "time": 20. },
  { "prover": "Z3:4.8.6", "verdict": "timeout", "time": 20. },
  { "prover": "Coq:8.12.2", "verdict": "unknown" },
  { "prover": "CVC4:1.9-prerelease:strings+counterexamples",
    "verdict": "timeout", "time": 20. },
  { "prover": "Alt-Ergo:2.4.0", "verdict": "timeout", "time": 20. } ]
