[ { "header": "Generic Logical Shift", "tactic": "Wp.gen_shift",
    "params": {},
    "select": { "select": "inside-goal", "occur": 0,
                "target": "let a_0 = (shiftfield_F14_Int32Eulers_psi ed_0) in\nlet m_0 =\n    Mint_3[(shiftfield_F18_Int32Rates_p r_0)\n      ->Mint_3[(shiftfield_F14_Int32Eulers_phi ed_0)]-\n         (lsr (pprz_itrig_sin_0*Mint_3[a_0]) 14)] in\n(lsr\n  (to_sint32\n    ((lsr (cphi_0*ctheta_0) 14)*\n     m_0[(shiftfield_F18_Int32Rates_q r_0)\n       ->(lsr (cphi_0*m_0[(shiftfield_F14_Int32Eulers_theta ed_0)]) 14)+\n          (lsr ((lsr (ctheta_0*sphi_0) 14)*m_0[a_0]) 14)][a_0])) 14)",
                "pattern": "lsrto_sint3214*lsr[]*14[=]shiftfield_F14_Int32Eulers_psi" },
    "children": { "gen_shift": [ { "header": "Congruence",
                                   "tactic": "Wp.congruence", "params": {},
                                   "select": { "select": "clause-goal",
                                               "target": "let a_0 = (shiftfield_F14_Int32Eulers_psi ed_0) in\nlet m_0 =\n    Mint_3[(shiftfield_F18_Int32Rates_p r_0)\n      ->Mint_3[(shiftfield_F14_Int32Eulers_phi ed_0)]-\n         (lsr (pprz_itrig_sin_0*Mint_3[a_0]) 14)] in\nlet a_1 = (shiftfield_F14_Int32Eulers_theta ed_0) in\nlet m_1 =\n    m_0[(shiftfield_F18_Int32Rates_q r_0)\n      ->(lsr (cphi_0*m_0[a_1]) 14)+\n         (lsr ((lsr (ctheta_0*sphi_0) 14)*m_0[a_0]) 14)] in\n((to_sint32 (sphi_0*m_1[a_1])) div 16384)<=\n(2147483648+((to_sint32 ((lsr (cphi_0*ctheta_0) 14)*m_1[a_0])) div 16384))",
                                               "pattern": "<=/+to_sint32163842147483648/*to_sint32" },
                                   "children": { "congruence": [ { "prover": "qed",
                                                                   "verdict": "valid" } ] } } ] } } ]
