[ { "prover": "Z3:4.8.6:noBV", "verdict": "timeout", "time": 10. },
  { "prover": "Z3:4.8.6:counterexamples", "verdict": "timeout", "time": 10. },
  { "prover": "Z3:4.8.6", "verdict": "timeout", "time": 10. },
  { "prover": "CVC4:1.9-prerelease:strings+counterexamples",
    "verdict": "timeout", "time": 10. },
  { "prover": "Alt-Ergo:2.3.3", "verdict": "timeout", "time": 10. },
  { "prover": "script", "verdict": "timeout", "time": 10. },
  { "header": "Definition", "tactic": "Wp.unfold", "params": {},
    "select": { "select": "inside-step", "at": 3, "kind": "have", "occur": 0,
                "target": "(L_trace_2_ Mf32_1 rm_0)",
                "pattern": "L_trace_2_$Mf32$rm" },
    "children": { "Unfold 'L_trace_2_'": [ { "prover": "Z3:4.8.6:noBV",
                                             "verdict": "timeout",
                                             "time": 10. },
                                           { "prover": "Z3:4.8.6:counterexamples",
                                             "verdict": "timeout",
                                             "time": 10. },
                                           { "prover": "Z3:4.8.6",
                                             "verdict": "timeout",
                                             "time": 10. },
                                           { "prover": "CVC4:1.9-prerelease:strings+counterexamples",
                                             "verdict": "timeout",
                                             "time": 10. },
                                           { "prover": "Alt-Ergo:2.3.3",
                                             "verdict": "timeout",
                                             "time": 10. },
                                           { "header": "Definition",
                                             "tactic": "Wp.unfold",
                                             "params": {},
                                             "select": { "select": "inside-step",
                                                         "at": 2,
                                                         "kind": "have",
                                                         "occur": 0,
                                                         "target": "(L_l_RMat_of_FloatRMat Mf32_1 rm_0)",
                                                         "pattern": "L_l_RMat_of_FloatRMat$Mf32$rm" },
                                             "children": { "Unfold 'L_l_RMat_of_FloatRMat'": 
                                                             [ { "prover": "Z3:4.8.6:noBV",
                                                                 "verdict": "timeout",
                                                                 "time": 10. },
                                                               { "prover": "Z3:4.8.6:counterexamples",
                                                                 "verdict": "timeout",
                                                                 "time": 10. },
                                                               { "prover": "Z3:4.8.6",
                                                                 "verdict": "timeout",
                                                                 "time": 10. },
                                                               { "prover": "CVC4:1.9-prerelease:strings+counterexamples",
                                                                 "verdict": "timeout",
                                                                 "time": 10. },
                                                               { "prover": "Alt-Ergo:2.3.3",
                                                                 "verdict": "timeout",
                                                                 "time": 10. },
                                                               { "header": "Definition",
                                                                 "tactic": "Wp.unfold",
                                                                 "params": {},
                                                                 "select": 
                                                                   { "select": "inside-step",
                                                                    "at": 3,
                                                                    "kind": "have",
                                                                    "occur": 0,
                                                                    "target": "let a_0 = (shiftfield_F6_FloatRMat_m rm_0) in\n(L_trace_1_\n  {\n     F9_RealRMat_s_a00 = Mf32_1[(shift_float32 a_0 0)] ;\n     F9_RealRMat_s_a01 = Mf32_1[(shift_float32 a_0 1)] ;\n     F9_RealRMat_s_a02 = Mf32_1[(shift_float32 a_0 2)] ;\n     F9_RealRMat_s_a10 = Mf32_1[(shift_float32 a_0 3)] ;\n     F9_RealRMat_s_a11 = Mf32_1[(shift_float32 a_0 4)] ;\n     F9_RealRMat_s_a12 = Mf32_1[(shift_float32 a_0 5)] ;\n     F9_RealRMat_s_a20 = Mf32_1[(shift_float32 a_0 6)] ;\n     F9_RealRMat_s_a21 = Mf32_1[(shift_float32 a_0 7)] ;\n     F9_RealRMat_s_a22 = Mf32_1[(shift_float32 a_0 8)]\n  })",
                                                                    "pattern": "L_trace_1_{RealRMat_s}[][][][][]" },
                                                                 "children": 
                                                                   { "Unfold 'L_trace_1_'": 
                                                                    [ { "prover": "Z3:4.8.6:noBV",
                                                                    "verdict": "timeout",
                                                                    "time": 10. },
                                                                    { "prover": "Z3:4.8.6:counterexamples",
                                                                    "verdict": "timeout",
                                                                    "time": 10. },
                                                                    { "prover": "Z3:4.8.6",
                                                                    "verdict": "timeout",
                                                                    "time": 10. },
                                                                    { "prover": "CVC4:1.9-prerelease:strings+counterexamples",
                                                                    "verdict": "timeout",
                                                                    "time": 10. },
                                                                    { "prover": "Alt-Ergo:2.3.3",
                                                                    "verdict": "timeout",
                                                                    "time": 10. },
                                                                    { "header": "Definition",
                                                                    "tactic": "Wp.unfold",
                                                                    "params": {},
                                                                    "select": 
                                                                    { "select": "inside-step",
                                                                    "at": 2,
                                                                    "kind": "have",
                                                                    "occur": 0,
                                                                    "target": "let a_0 = (shiftfield_F6_FloatRMat_m rm_0) in\n(P_rotation_matrix\n  {\n     F9_RealRMat_s_a00 = Mf32_1[(shift_float32 a_0 0)] ;\n     F9_RealRMat_s_a01 = Mf32_1[(shift_float32 a_0 1)] ;\n     F9_RealRMat_s_a02 = Mf32_1[(shift_float32 a_0 2)] ;\n     F9_RealRMat_s_a10 = Mf32_1[(shift_float32 a_0 3)] ;\n     F9_RealRMat_s_a11 = Mf32_1[(shift_float32 a_0 4)] ;\n     F9_RealRMat_s_a12 = Mf32_1[(shift_float32 a_0 5)] ;\n     F9_RealRMat_s_a20 = Mf32_1[(shift_float32 a_0 6)] ;\n     F9_RealRMat_s_a21 = Mf32_1[(shift_float32 a_0 7)] ;\n     F9_RealRMat_s_a22 = Mf32_1[(shift_float32 a_0 8)]\n  })",
                                                                    "pattern": "P_rotation_matrix{RealRMat_s}[][]" },
                                                                    "children": 
                                                                    { "Unfold 'P_rotation_matrix'": 
                                                                    [ { "prover": "Z3:4.8.6:noBV",
                                                                    "verdict": "timeout",
                                                                    "time": 10. },
                                                                    { "prover": "Z3:4.8.6:counterexamples",
                                                                    "verdict": "timeout",
                                                                    "time": 10. },
                                                                    { "prover": "Z3:4.8.6",
                                                                    "verdict": "timeout",
                                                                    "time": 10. },
                                                                    { "prover": "CVC4:1.9-prerelease:strings+counterexamples",
                                                                    "verdict": "timeout",
                                                                    "time": 10. },
                                                                    { "prover": "Alt-Ergo:2.3.3",
                                                                    "verdict": "timeout",
                                                                    "time": 10. },
                                                                    { "header": "Definition",
                                                                    "tactic": "Wp.unfold",
                                                                    "params": {},
                                                                    "select": 
                                                                    { "select": "inside-step",
                                                                    "at": 2,
                                                                    "kind": "have",
                                                                    "occur": 0,
                                                                    "target": "let a_0 = (shiftfield_F6_FloatRMat_m rm_0) in\nlet a_1 =\n    {\n       F9_RealRMat_s_a00 = Mf32_1[(shift_float32 a_0 0)] ;\n       F9_RealRMat_s_a01 = Mf32_1[(shift_float32 a_0 1)] ;\n       F9_RealRMat_s_a02 = Mf32_1[(shift_float32 a_0 2)] ;\n       F9_RealRMat_s_a10 = Mf32_1[(shift_float32 a_0 3)] ;\n       F9_RealRMat_s_a11 = Mf32_1[(shift_float32 a_0 4)] ;\n       F9_RealRMat_s_a12 = Mf32_1[(shift_float32 a_0 5)] ;\n       F9_RealRMat_s_a20 = Mf32_1[(shift_float32 a_0 6)] ;\n       F9_RealRMat_s_a21 = Mf32_1[(shift_float32 a_0 7)] ;\n       F9_RealRMat_s_a22 = Mf32_1[(shift_float32 a_0 8)]\n    } in\n(L_mult_RealRMat a_1 (L_transpose a_1))",
                                                                    "pattern": "L_mult_RealRMat{RealRMat_s}L_transpose" },
                                                                    "children": 
                                                                    { "Unfold 'L_mult_RealRMat'": 
                                                                    [ { "prover": "Z3:4.8.6:noBV",
                                                                    "verdict": "timeout",
                                                                    "time": 10. },
                                                                    { "prover": "Z3:4.8.6:counterexamples",
                                                                    "verdict": "timeout",
                                                                    "time": 10. },
                                                                    { "prover": "Z3:4.8.6",
                                                                    "verdict": "timeout",
                                                                    "time": 10. },
                                                                    { "prover": "CVC4:1.9-prerelease:strings+counterexamples",
                                                                    "verdict": "timeout",
                                                                    "time": 10. },
                                                                    { "prover": "Alt-Ergo:2.3.3",
                                                                    "verdict": "timeout",
                                                                    "time": 10. },
                                                                    { "header": "Definition",
                                                                    "tactic": "Wp.unfold",
                                                                    "params": {},
                                                                    "select": 
                                                                    { "select": "inside-step",
                                                                    "at": 2,
                                                                    "kind": "have",
                                                                    "occur": 0,
                                                                    "target": "let a_0 = (shiftfield_F6_FloatRMat_m rm_0) in\n(L_transpose\n  {\n     F9_RealRMat_s_a00 = Mf32_1[(shift_float32 a_0 0)] ;\n     F9_RealRMat_s_a01 = Mf32_1[(shift_float32 a_0 1)] ;\n     F9_RealRMat_s_a02 = Mf32_1[(shift_float32 a_0 2)] ;\n     F9_RealRMat_s_a10 = Mf32_1[(shift_float32 a_0 3)] ;\n     F9_RealRMat_s_a11 = Mf32_1[(shift_float32 a_0 4)] ;\n     F9_RealRMat_s_a12 = Mf32_1[(shift_float32 a_0 5)] ;\n     F9_RealRMat_s_a20 = Mf32_1[(shift_float32 a_0 6)] ;\n     F9_RealRMat_s_a21 = Mf32_1[(shift_float32 a_0 7)] ;\n     F9_RealRMat_s_a22 = Mf32_1[(shift_float32 a_0 8)]\n  })",
                                                                    "pattern": "L_transpose{RealRMat_s}[][][][][]" },
                                                                    "children": 
                                                                    { "Unfold 'L_transpose'": 
                                                                    [ { "prover": "Z3:4.8.6:noBV",
                                                                    "verdict": "timeout",
                                                                    "time": 10. },
                                                                    { "prover": "Z3:4.8.6:counterexamples",
                                                                    "verdict": "timeout",
                                                                    "time": 10. },
                                                                    { "prover": "Z3:4.8.6",
                                                                    "verdict": "timeout",
                                                                    "time": 10. },
                                                                    { "prover": "CVC4:1.9-prerelease:strings+counterexamples",
                                                                    "verdict": "timeout",
                                                                    "time": 10. },
                                                                    { "prover": "Alt-Ergo:2.3.3",
                                                                    "verdict": "timeout",
                                                                    "time": 10. },
                                                                    { "header": "Definition",
                                                                    "tactic": "Wp.unfold",
                                                                    "params": {},
                                                                    "select": 
                                                                    { "select": "inside-step",
                                                                    "at": 2,
                                                                    "kind": "have",
                                                                    "occur": 0,
                                                                    "target": "L_id_rmat",
                                                                    "pattern": "L_id_rmat" },
                                                                    "children": 
                                                                    { "Unfold 'L_id_rmat'": 
                                                                    [ { "prover": "Z3:4.8.6:noBV",
                                                                    "verdict": "timeout",
                                                                    "time": 10. },
                                                                    { "prover": "Z3:4.8.6:counterexamples",
                                                                    "verdict": "timeout",
                                                                    "time": 10. },
                                                                    { "prover": "Z3:4.8.6",
                                                                    "verdict": "timeout",
                                                                    "time": 10. },
                                                                    { "prover": "CVC4:1.9-prerelease:strings+counterexamples",
                                                                    "verdict": "timeout",
                                                                    "time": 10. },
                                                                    { "prover": "Alt-Ergo:2.3.3",
                                                                    "verdict": "timeout",
                                                                    "time": 10. },
                                                                    { "header": "Definition",
                                                                    "tactic": "Wp.unfold",
                                                                    "params": {},
                                                                    "select": 
                                                                    { "select": "inside-step",
                                                                    "at": 2,
                                                                    "kind": "have",
                                                                    "occur": 0,
                                                                    "target": "let a_0 = (shiftfield_F6_FloatRMat_m rm_0) in\nlet r_0 = Mf32_1[(shift_float32 a_0 0)] in\nlet r_1 = Mf32_1[(shift_float32 a_0 1)] in\nlet r_2 = Mf32_1[(shift_float32 a_0 2)] in\nlet r_3 = Mf32_1[(shift_float32 a_0 3)] in\nlet r_4 = Mf32_1[(shift_float32 a_0 4)] in\nlet r_5 = Mf32_1[(shift_float32 a_0 5)] in\nlet r_6 = ((r_0*r_3)+(r_1*r_4)+(r_2*r_5)) in\nlet r_7 = Mf32_1[(shift_float32 a_0 6)] in\nlet r_8 = Mf32_1[(shift_float32 a_0 7)] in\nlet r_9 = Mf32_1[(shift_float32 a_0 8)] in\nlet r_10 = ((r_0*r_7)+(r_1*r_8)+(r_2*r_9)) in\nlet r_11 = ((r_3*r_7)+(r_4*r_8)+(r_5*r_9)) in\n(EqS9_RealRMat_s\n  {\n     F9_RealRMat_s_a00 = (r_0*r_0)+(r_1*r_1)+(r_2*r_2) ;\n     F9_RealRMat_s_a01 = r_6 ;\n     F9_RealRMat_s_a02 = r_10 ;\n     F9_RealRMat_s_a10 = r_6 ;\n     F9_RealRMat_s_a11 = (r_3*r_3)+(r_4*r_4)+(r_5*r_5) ;\n     F9_RealRMat_s_a12 = r_11 ;\n     F9_RealRMat_s_a20 = r_10 ;\n     F9_RealRMat_s_a21 = r_11 ;\n     F9_RealRMat_s_a22 = (r_7*r_7)+(r_8*r_8)+(r_9*r_9)\n  }\n  {\n     F9_RealRMat_s_a00 = 1 ;\n     F9_RealRMat_s_a01 = 0 ;\n     F9_RealRMat_s_a02 = 0 ;\n     F9_RealRMat_s_a10 = 0 ;\n     F9_RealRMat_s_a11 = 1 ;\n     F9_RealRMat_s_a12 = 0 ;\n     F9_RealRMat_s_a20 = 0 ;\n     F9_RealRMat_s_a21 = 0 ;\n     F9_RealRMat_s_a22 = 1\n  })",
                                                                    "pattern": "EqS9_RealRMat_s{RealRMat_s}{RealRMat_s}" },
                                                                    "children": 
                                                                    { "Unfold 'EqS9_RealRMat_s'": 
                                                                    [ { "prover": "Z3:4.8.6:noBV",
                                                                    "verdict": "timeout",
                                                                    "time": 10. },
                                                                    { "prover": "Z3:4.8.6:counterexamples",
                                                                    "verdict": "timeout",
                                                                    "time": 10. },
                                                                    { "prover": "Z3:4.8.6",
                                                                    "verdict": "timeout",
                                                                    "time": 10. },
                                                                    { "prover": "CVC4:1.9-prerelease:strings+counterexamples",
                                                                    "verdict": "timeout",
                                                                    "time": 10. },
                                                                    { "prover": "Alt-Ergo:2.3.3",
                                                                    "verdict": "timeout",
                                                                    "time": 10. },
                                                                    { "header": "Definition",
                                                                    "tactic": "Wp.unfold",
                                                                    "params": {},
                                                                    "select": 
                                                                    { "select": "clause-goal",
                                                                    "target": "let a_0 = (shiftfield_F6_FloatRMat_m rm_0) in\nlet r_0 =\n    (\\sqrt\n      (1+Mf32_1[(shift_float32 a_0 0)]+Mf32_1[(shift_float32 a_0 4)]+\n       Mf32_1[(shift_float32 a_0 8)])) in\nlet m_0 = Mf32_1[(shiftfield_F4_FloatQuat_qi q_0)->1/2*r_0] in\nlet r_1 = (2*r_0) in\nlet m_1 =\n    m_0[(shiftfield_F4_FloatQuat_qx q_0)\n      ->(m_0[(shift_float32 a_0 5)]-m_0[(shift_float32 a_0 7)]) div r_1] in\nlet m_2 =\n    m_1[(shiftfield_F4_FloatQuat_qy q_0)\n      ->(m_1[(shift_float32 a_0 6)]-m_1[(shift_float32 a_0 2)]) div r_1] in\n(P_unitary_quaternion\n  m_2[(shiftfield_F4_FloatQuat_qz q_0)\n    ->(m_2[(shift_float32 a_0 1)]-m_2[(shift_float32 a_0 3)]) div r_1] q_0)",
                                                                    "pattern": "P_unitary_quaternion[=]$q[=]shiftfield_F4_FloatQuat_qz" },
                                                                    "children": 
                                                                    { "Unfold 'P_unitary_quaternion'": 
                                                                    [ { "prover": "Z3:4.8.6:noBV",
                                                                    "verdict": "timeout",
                                                                    "time": 10. },
                                                                    { "prover": "Z3:4.8.6:counterexamples",
                                                                    "verdict": "timeout",
                                                                    "time": 10. },
                                                                    { "prover": "Z3:4.8.6",
                                                                    "verdict": "timeout",
                                                                    "time": 10. },
                                                                    { "prover": "CVC4:1.9-prerelease:strings+counterexamples",
                                                                    "verdict": "timeout",
                                                                    "time": 10. },
                                                                    { "prover": "Alt-Ergo:2.3.3",
                                                                    "verdict": "timeout",
                                                                    "time": 10. } ] } } ] } } ] } } ] } } ] } } ] } } ] } } ] } } ] } } ]
