[ { "prover": "Z3:4.8.10:counterexamples", "verdict": "failed" },
  { "prover": "CVC4:1.9-prerelease:strings+counterexamples",
    "verdict": "timeout", "time": 10. },
  { "prover": "Alt-Ergo:2.3.3", "verdict": "timeout", "time": 10. } ]
