[ { "header": "Generic Logical Shift", "tactic": "Wp.gen_shift",
    "params": {},
    "select": { "select": "inside-goal", "occur": 0,
                "target": "let x_0 = Mint_6[(shiftfield_F11_Int32Quat_qx q_0)] in (lsr (x_0*x_0) 15)",
                "pattern": "lsr*15[][]$Mintshiftfield_F11_Int32Quat_qx" },
    "children": { "gen_shift": [ { "header": "Generic Logical Shift",
                                   "tactic": "Wp.gen_shift", "params": {},
                                   "select": { "select": "inside-goal",
                                               "occur": 0,
                                               "target": "let x_0 = Mint_6[(shiftfield_F11_Int32Quat_qy q_0)] in (lsr (x_0*x_0) 15)",
                                               "pattern": "lsr*15[][]$Mintshiftfield_F11_Int32Quat_qy" },
                                   "children": { "gen_shift": [ { "prover": "CVC4:1.9-prerelease:strings+counterexamples",
                                                                  "verdict": "valid",
                                                                  "time": 0.61 } ] } } ] } } ]
