[ { "header": "Logical Shift", "tactic": "Wp.shift", "params": {},
    "select": { "select": "inside-step", "at": 42, "kind": "have",
                "occur": 0, "target": "(lsr (c_psi2_0*c_theta2_0) 14)",
                "pattern": "lsr*14$c_psi2$c_theta2" },
    "children": { "positive": [ { "prover": "Alt-Ergo:2.3.3",
                                  "verdict": "valid", "time": 0.0928,
                                  "steps": 30 } ],
                  "shift": [ { "header": "Logical Shift",
                               "tactic": "Wp.shift", "params": {},
                               "select": { "select": "inside-step", "at": 44,
                                           "kind": "have", "occur": 0,
                                           "target": "(lsr (pprz_itrig_sin_0*pprz_itrig_sin_1) 14)",
                                           "pattern": "lsr*14$pprz_itrig_sin$pprz_itrig_sin" },
                               "children": { "positive": [ { "prover": "Alt-Ergo:2.3.3",
                                                             "verdict": "valid",
                                                             "time": 0.0708,
                                                             "steps": 30 } ],
                                             "shift": [ { "header": "Logical Shift",
                                                          "tactic": "Wp.shift",
                                                          "params": {},
                                                          "select": { "select": "inside-goal",
                                                                    "occur": 0,
                                                                    "target": "(lsr (c_psi2_0*pprz_itrig_sin_1) 14)",
                                                                    "pattern": "lsr*14$c_psi2$pprz_itrig_sin" },
                                                          "children": 
                                                            { "positive": 
                                                                [ { "prover": "Alt-Ergo:2.3.3",
                                                                    "verdict": "valid",
                                                                    "time": 0.049,
                                                                    "steps": 30 } ],
                                                              "shift": 
                                                                [ { "prover": "Alt-Ergo:2.3.3",
                                                                    "verdict": "valid",
                                                                    "time": 0.7111,
                                                                    "steps": 166 } ] } } ] } } ] } } ]
