[ { "header": "Overflow", "tactic": "Wp.overflow", "params": {},
    "select": { "select": "inside-goal", "occur": 0,
                "target": "(to_sint32 (2147483647 div n_0))",
                "pattern": "to_sint32/2147483647$n" },
    "children": { "In-Range": [ { "prover": "Alt-Ergo:2.3.3",
                                  "verdict": "valid", "time": 0.0173,
                                  "steps": 100 } ],
                  "No-Overflow": [ { "prover": "Alt-Ergo:2.3.3",
                                     "verdict": "valid", "time": 0.0198,
                                     "steps": 28 } ] } } ]
