[ { "header": "Generic Logical Shift", "tactic": "Wp.gen_shift",
    "params": {},
    "select": { "select": "inside-goal", "occur": 0,
                "target": "let a_0 = (shiftfield_F15_Int32RMat_m rm_2) in\nlet x_0 = Mint_15[(shiftfield_F11_Int32Quat_qx q_0)] in\nlet m_0 = Mint_15[(shift_sint32 a_0 0)->(lsr (x_0*x_0) 15)] in\nlet a_1 = (shiftfield_F11_Int32Quat_qy q_0) in\nlet x_1 = m_0[a_1] in\nlet m_1 = m_0[(shift_sint32 a_0 4)->(lsr (x_1*x_1) 15)] in\nlet x_2 = m_1[(shiftfield_F11_Int32Quat_qz q_0)] in\nlet m_2 = m_1[(shift_sint32 a_0 8)->(lsr (x_2*x_2) 15)] in\n(lsr (m_2[(shiftfield_F11_Int32Quat_qi q_0)]*m_2[a_1]) 15)",
                "pattern": "lsr*15[][][=]shiftfield_F11_Int32Quat_qi" },
    "children": { "gen_shift": [ { "header": "Generic Logical Shift",
                                   "tactic": "Wp.gen_shift", "params": {},
                                   "select": { "select": "inside-goal",
                                               "occur": 0,
                                               "target": "let a_0 = (shiftfield_F15_Int32RMat_m rm_2) in\nlet a_1 = (shiftfield_F11_Int32Quat_qx q_0) in\nlet x_0 = Mint_15[a_1] in\nlet m_0 = Mint_15[(shift_sint32 a_0 0)->(lsr (x_0*x_0) 15)] in\nlet a_2 = (shiftfield_F11_Int32Quat_qy q_0) in\nlet x_1 = m_0[a_2] in\nlet m_1 = m_0[(shift_sint32 a_0 4)->(lsr (x_1*x_1) 15)] in\nlet a_3 = (shiftfield_F11_Int32Quat_qz q_0) in\nlet x_2 = m_1[a_3] in\nlet m_2 = m_1[(shift_sint32 a_0 8)->(lsr (x_2*x_2) 15)] in\nlet m_3 = m_2[(shift_sint32 a_0 1)->(lsr (m_2[a_1]*m_2[a_2]) 15)] in\n(lsr (m_3[a_1]*m_3[a_3]) 15)",
                                               "pattern": "lsr*15[][][=]shiftfield_F11_Int32Quat_qx" },
                                   "children": { "gen_shift": [ { "prover": "CVC4:1.9-prerelease:strings+counterexamples",
                                                                  "verdict": "valid",
                                                                  "time": 3.6 } ] } } ] } } ]
