[ { "header": "Range", "tactic": "Wp.range",
    "params": { "inf": 0, "sup": 14 },
    "select": { "select": "inside-goal", "occur": 0, "target": "frac_0",
                "pattern": "$frac" },
    "children": { "Lower 0": [ { "prover": "qed", "verdict": "valid" } ],
                  "Value 0": [ { "prover": "qed", "verdict": "valid" } ],
                  "Value 1": [ { "prover": "qed", "verdict": "valid" } ],
                  "Value 2": [ { "prover": "qed", "verdict": "valid" } ],
                  "Value 3": [ { "prover": "qed", "verdict": "valid" } ],
                  "Value 4": [ { "prover": "qed", "verdict": "valid" } ],
                  "Value 5": [ { "prover": "qed", "verdict": "valid" } ],
                  "Value 6": [ { "prover": "qed", "verdict": "valid" } ],
                  "Value 7": [ { "prover": "qed", "verdict": "valid" } ],
                  "Value 8": [ { "prover": "qed", "verdict": "valid" } ],
                  "Value 9": [ { "prover": "qed", "verdict": "valid" } ],
                  "Value 10": [ { "prover": "qed", "verdict": "valid" } ],
                  "Value 11": [ { "prover": "qed", "verdict": "valid" } ],
                  "Value 12": [ { "prover": "qed", "verdict": "valid" } ],
                  "Value 13": [ { "prover": "qed", "verdict": "valid" } ],
                  "Value 14": [ { "prover": "qed", "verdict": "valid" } ],
                  "Upper 14": [ { "prover": "qed", "verdict": "valid" } ] } } ]
