[ { "header": "Definition", "tactic": "Wp.unfold", "params": {},
    "select": { "select": "clause-step", "at": 23, "kind": "have",
                "target": "let a_0 = (shiftfield_F15_Int32RMat_m m_a2b_0) in\nlet a_1 = (shiftfield_F15_Int32RMat_m m_b2c_0) in\n(P_unchanged_Int32RMat\n  Mint_3[(shift_sint32 (shiftfield_F15_Int32RMat_m m_a2c_0) 0)\n    ->(lsr\n        ((Mint_3[(shift_sint32 a_0 0)]*Mint_3[(shift_sint32 a_1 0)])+\n         (Mint_3[(shift_sint32 a_0 3)]*Mint_3[(shift_sint32 a_1 1)])+\n         (Mint_3[(shift_sint32 a_0 6)]*Mint_3[(shift_sint32 a_1 2)])) 14)]\n  Mint_3 m_a2b_0)",
                "pattern": "P_unchanged_Int32RMat[=]$Mint$m_a2b" },
    "children": { "Unfold 'P_unchanged_Int32RMat'": [ { "header": "Definition",
                                                        "tactic": "Wp.unfold",
                                                        "params": {},
                                                        "select": { "select": "clause-step",
                                                                    "at": 25,
                                                                    "kind": "have",
                                                                    "target": "let a_0 = (shiftfield_F15_Int32RMat_m m_a2b_0) in\nlet a_1 = (shiftfield_F15_Int32RMat_m m_b2c_0) in\n(P_unchanged_Int32RMat\n  Mint_3[(shift_sint32 (shiftfield_F15_Int32RMat_m m_a2c_0) 0)\n    ->(lsr\n        ((Mint_3[(shift_sint32 a_0 0)]*Mint_3[(shift_sint32 a_1 0)])+\n         (Mint_3[(shift_sint32 a_0 3)]*Mint_3[(shift_sint32 a_1 1)])+\n         (Mint_3[(shift_sint32 a_0 6)]*Mint_3[(shift_sint32 a_1 2)])) 14)]\n  Mint_3 m_b2c_0)",
                                                                    "pattern": "P_unchanged_Int32RMat[=]$Mint$m_b2c" },
                                                        "children": { "Unfold 'P_unchanged_Int32RMat'": 
                                                                    [ { "header": "Definition",
                                                                    "tactic": "Wp.unfold",
                                                                    "params": {},
                                                                    "select": 
                                                                    { "select": "clause-step",
                                                                    "at": 42,
                                                                    "kind": "have",
                                                                    "target": "let a_0 = (shiftfield_F15_Int32RMat_m m_a2c_0) in\nlet a_1 = (shiftfield_F15_Int32RMat_m m_a2b_0) in\nlet a_2 = (shiftfield_F15_Int32RMat_m m_b2c_0) in\nlet a_3 = (shift_sint32 a_2 0) in\nlet a_4 = (shift_sint32 a_2 1) in\nlet a_5 = (shift_sint32 a_2 2) in\nlet m_0 =\n    Mint_3[(shift_sint32 a_0 0)\n      ->(lsr\n          ((Mint_3[(shift_sint32 a_1 0)]*Mint_3[a_3])+\n           (Mint_3[(shift_sint32 a_1 3)]*Mint_3[a_4])+\n           (Mint_3[(shift_sint32 a_1 6)]*Mint_3[a_5])) 14)] in\n(P_unchanged_Int32RMat\n  m_0[(shift_sint32 a_0 1)\n    ->(lsr\n        ((m_0[(shift_sint32 a_1 1)]*m_0[a_3])+\n         (m_0[(shift_sint32 a_1 4)]*m_0[a_4])+\n         (m_0[(shift_sint32 a_1 7)]*m_0[a_5])) 14)] Mint_3 m_a2b_0)",
                                                                    "pattern": "P_unchanged_Int32RMat[=]$Mint$m_a2b" },
                                                                    "children": 
                                                                    { "Unfold 'P_unchanged_Int32RMat'": 
                                                                    [ { "prover": "Alt-Ergo:2.3.3",
                                                                    "verdict": "valid",
                                                                    "time": 8.4942,
                                                                    "steps": 1475 } ] } } ] } } ] } } ]
