[ { "header": "Congruence", "tactic": "Wp.congruence", "params": {},
    "select": { "select": "clause-goal",
                "target": "let a_0 = (shiftfield_F18_Int32Rates_r r_0) in\nlet a_1 = (shiftfield_F18_Int32Rates_q r_0) in\nlet m_0 =\n    Mint_3[(shiftfield_F14_Int32Eulers_phi ed_2)\n      ->(to_sint32\n          (((lsr (cphi_0*pprz_itrig_sin_0) 14)*Mint_3[a_0]) div ctheta_0))+\n         (to_sint32\n           (((lsr (pprz_itrig_sin_0*sphi_0) 14)*Mint_3[a_1]) div ctheta_0))+\n         Mint_3[(shiftfield_F18_Int32Rates_p r_0)]] in\n((to_sint32 (cphi_0*m_0[a_1])) div 16384)<=\n(2147483647+(lsr (to_sint32 (sphi_0*m_0[a_0])) 14))",
                "pattern": "<=/+to_sint32163842147483647lsr*" },
    "children": { "congruence": [ { "prover": "qed", "verdict": "valid" } ] } } ]
