[ { "header": "Generic Logical Shift", "tactic": "Wp.gen_shift",
    "params": {},
    "select": { "select": "inside-goal", "occur": 0,
                "target": "(lsr\n  (Mint_6[(shiftfield_F11_Int32Quat_qi q_0)]*\n   Mint_6[(shiftfield_F11_Int32Quat_qy q_0)]) 15)",
                "pattern": "lsr*15[][]$Mintshiftfield_F11_Int32Quat_qi" },
    "children": { "gen_shift": [ { "header": "Generic Logical Shift",
                                   "tactic": "Wp.gen_shift", "params": {},
                                   "select": { "select": "inside-goal",
                                               "occur": 0,
                                               "target": "(lsr\n  (Mint_6[(shiftfield_F11_Int32Quat_qx q_0)]*\n   Mint_6[(shiftfield_F11_Int32Quat_qz q_0)]) 15)",
                                               "pattern": "lsr*15[][]$Mintshiftfield_F11_Int32Quat_qx" },
                                   "children": { "gen_shift": [ { "prover": "CVC4:1.9-prerelease:strings+counterexamples",
                                                                  "verdict": "valid",
                                                                  "time": 0.71 } ] } } ] } } ]
