[ { "header": "Definition", "tactic": "Wp.unfold", "params": {},
    "select": { "select": "inside-step", "at": 3, "kind": "have", "occur": 0,
                "target": "(P_valid_bound_Int32Quat Malloc_0 Mint_15 q_2 32768)",
                "pattern": "P_valid_bound_Int32Quat$Malloc$Mint" },
    "children": { "Unfold 'P_valid_bound_Int32Quat'": [ { "header": "Definition",
                                                          "tactic": "Wp.unfold",
                                                          "params": {},
                                                          "select": { "select": "inside-step",
                                                                    "at": 3,
                                                                    "kind": "have",
                                                                    "occur": 0,
                                                                    "target": "(P_bound_Int32Quat Mint_15 q_2 32768)",
                                                                    "pattern": "P_bound_Int32Quat$Mint$q32768" },
                                                          "children": 
                                                            { "Unfold 'P_bound_Int32Quat'": 
                                                                [ { "header": "Definition",
                                                                    "tactic": "Wp.unfold",
                                                                    "params": {},
                                                                    "select": 
                                                                    { "select": "inside-step",
                                                                    "at": 3,
                                                                    "kind": "have",
                                                                    "occur": 0,
                                                                    "target": "(P_valid_bound_Int64Quat Malloc_0 Mint_21 hr_2 65536)",
                                                                    "pattern": "P_valid_bound_Int64Quat$Malloc$Mint" },
                                                                    "children": 
                                                                    { "Unfold 'P_valid_bound_Int64Quat'": 
                                                                    [ { "header": "Definition",
                                                                    "tactic": "Wp.unfold",
                                                                    "params": {},
                                                                    "select": 
                                                                    { "select": "inside-step",
                                                                    "at": 3,
                                                                    "kind": "have",
                                                                    "occur": 0,
                                                                    "target": "(P_rvalid_bound_Int32Rates Malloc_0 Mint_15 omega_0 163840)",
                                                                    "pattern": "P_rvalid_bound_Int32Rates$Malloc" },
                                                                    "children": 
                                                                    { "Unfold 'P_rvalid_bound_Int32Rates'": 
                                                                    [ { "header": "Definition",
                                                                    "tactic": "Wp.unfold",
                                                                    "params": {},
                                                                    "select": 
                                                                    { "select": "inside-step",
                                                                    "at": 3,
                                                                    "kind": "have",
                                                                    "occur": 0,
                                                                    "target": "(P_bound_Int32Rates Mint_15 omega_0 163840)",
                                                                    "pattern": "P_bound_Int32Rates$Mint$omega163840" },
                                                                    "children": 
                                                                    { "Unfold 'P_bound_Int32Rates'": 
                                                                    [ { "header": "Definition",
                                                                    "tactic": "Wp.unfold",
                                                                    "params": {},
                                                                    "select": 
                                                                    { "select": "inside-step",
                                                                    "at": 3,
                                                                    "kind": "have",
                                                                    "occur": 0,
                                                                    "target": "(P_bound_Int64Quat Mint_21 hr_2 65536)",
                                                                    "pattern": "P_bound_Int64Quat$Mint$hr65536" },
                                                                    "children": 
                                                                    { "Unfold 'P_bound_Int64Quat'": 
                                                                    [ { "prover": "Alt-Ergo:2.3.3",
                                                                    "verdict": "valid",
                                                                    "time": 3.1466,
                                                                    "steps": 495 } ] } } ] } } ] } } ] } } ] } } ] } } ]
