[ { "header": "Generic Logical Shift", "tactic": "Wp.gen_shift",
    "params": {},
    "select": { "select": "inside-goal", "occur": 0,
                "target": "(lsr (cpsi_0*(lsr (cphi_0*pprz_itrig_sin_1) 14)) 14)",
                "pattern": "lsr*14$cpsilsr*14$cphi$pprz_itrig_sin" },
    "children": { "gen_shift": [ { "header": "Generic Logical Shift",
                                   "tactic": "Wp.gen_shift", "params": {},
                                   "select": { "select": "inside-goal",
                                               "occur": 0,
                                               "target": "(lsr (pprz_itrig_sin_0*pprz_itrig_sin_2) 14)",
                                               "pattern": "lsr*14$pprz_itrig_sin$pprz_itrig_sin" },
                                   "children": { "gen_shift": [ { "prover": "CVC4:1.9-prerelease:strings+counterexamples",
                                                                  "verdict": "valid",
                                                                  "time": 0.27 } ] } } ] } } ]
