[ { "prover": "Alt-Ergo:2.3.3", "verdict": "timeout", "time": 10. },
  { "prover": "script", "verdict": "valid" },
  { "header": "Definition", "tactic": "Wp.unfold", "params": {},
    "select": { "select": "inside-step", "at": 3, "kind": "have", "occur": 0,
                "target": "(P_rvalid_bound_Int32Vect3 Malloc_0 Mint_3 va_0 26754)",
                "pattern": "P_rvalid_bound_Int32Vect3$Malloc" },
    "children": { "Unfold 'P_rvalid_bound_Int32Vect3'": [ { "prover": "Alt-Ergo:2.3.3",
                                                            "verdict": "valid",
                                                            "time": 0.1558,
                                                            "steps": 477 } ] } } ]
