[ { "header": "Generic Logical Shift", "tactic": "Wp.gen_shift",
    "params": {},
    "select": { "select": "inside-goal", "occur": 0,
                "target": "let x_0 = Mint_15[(shiftfield_F11_Int32Quat_qi q_0)] in (lsr (x_0*x_0) 15)",
                "pattern": "lsr*15[][]$Mintshiftfield_F11_Int32Quat_qi" },
    "children": { "gen_shift": [ { "header": "Generic Logical Shift",
                                   "tactic": "Wp.gen_shift", "params": {},
                                   "select": { "select": "inside-goal",
                                               "occur": 0,
                                               "target": "let a_0 = (shiftfield_F15_Int32RMat_m rm_2) in\nlet x_0 = Mint_15[(shiftfield_F11_Int32Quat_qx q_0)] in\nlet m_0 = Mint_15[(shift_sint32 a_0 0)->(lsr (x_0*x_0) 15)] in\nlet x_1 = m_0[(shiftfield_F11_Int32Quat_qy q_0)] in\nlet x_2 =\n    m_0[(shift_sint32 a_0 4)->(lsr (x_1*x_1) 15)]\n      [(shiftfield_F11_Int32Quat_qz q_0)] in\n(lsr (x_2*x_2) 15)",
                                               "pattern": "lsr*15[][][=]shiftfield_F11_Int32Quat_qz" },
                                   "children": { "gen_shift": [ { "prover": "Alt-Ergo:2.3.3",
                                                                  "verdict": "valid",
                                                                  "time": 0.5672,
                                                                  "steps": 391 } ] } } ] } } ]
