[ { "header": "Split", "tactic": "Wp.split", "params": {},
    "select": { "select": "clause-step", "at": 10, "kind": "branch",
                "target": "let a_0 = (shiftfield_F9_FloatRMat_m rm_0) in\nMf32_1[(shift_float32 a_0 4)]<Mf32_1[(shift_float32 a_0 0)]",
                "pattern": "<[][]$Mf32shift_float32$Mf32shift_float32" },
    "children": { "Then": [ { "header": "Split", "tactic": "Wp.split",
                              "params": {},
                              "select": { "select": "clause-step", "at": 12,
                                          "kind": "branch",
                                          "target": "let a_0 = (shiftfield_F9_FloatRMat_m rm_0) in\nMf32_1[(shift_float32 a_0 8)]<Mf32_1[(shift_float32 a_0 0)]",
                                          "pattern": "<[][]$Mf32shift_float32$Mf32shift_float32" },
                              "children": { "Then": [ { "prover": "CVC4:1.9-prerelease:strings+counterexamples",
                                                        "verdict": "valid",
                                                        "time": 2.89 } ],
                                            "Else": [ { "header": "Split",
                                                        "tactic": "Wp.split",
                                                        "params": {},
                                                        "select": { "select": "clause-step",
                                                                    "at": 16,
                                                                    "kind": "branch",
                                                                    "target": "let a_0 = (shiftfield_F9_FloatRMat_m rm_0) in\nMf32_1[(shift_float32 a_0 8)]<Mf32_1[(shift_float32 a_0 4)]",
                                                                    "pattern": "<[][]$Mf32shift_float32$Mf32shift_float32" },
                                                        "children": { "Then": 
                                                                    [ { "prover": "Alt-Ergo:2.3.3",
                                                                    "verdict": "valid",
                                                                    "time": 0.0488,
                                                                    "steps": 28 } ],
                                                                    "Else": 
                                                                    [ { "prover": "CVC4:1.9-prerelease:strings+counterexamples",
                                                                    "verdict": "valid",
                                                                    "time": 2.45 } ] } } ] } } ],
                  "Else": [ { "header": "Split", "tactic": "Wp.split",
                              "params": {},
                              "select": { "select": "clause-step", "at": 13,
                                          "kind": "branch",
                                          "target": "let a_0 = (shiftfield_F9_FloatRMat_m rm_0) in\nMf32_1[(shift_float32 a_0 8)]<Mf32_1[(shift_float32 a_0 4)]",
                                          "pattern": "<[][]$Mf32shift_float32$Mf32shift_float32" },
                              "children": { "Then": [ { "prover": "CVC4:1.9-prerelease:strings+counterexamples",
                                                        "verdict": "valid",
                                                        "time": 6.99 } ],
                                            "Else": [ { "prover": "Alt-Ergo:2.3.3",
                                                        "verdict": "valid",
                                                        "time": 0.8399,
                                                        "steps": 737 } ] } } ] } } ]
