Elapsed time : 51936 us
Elapsed time : 118449 us
Elapsed time : 118601 us
Elapsed time : 118564 us
Elapsed time : 119175 us
Elapsed time : 118537 us
Elapsed time : 118664 us
Elapsed time : 118461 us
Elapsed time : 118726 us
Elapsed time : 119070 us
Elapsed time : 118405 us
Elapsed time : 118769 us
Elapsed time : 118339 us
Elapsed time : 118849 us
Elapsed time : 118698 us
Elapsed time : 118717 us
Elapsed time : 118083 us
Elapsed time : 118196 us
Elapsed time : 118350 us
Elapsed time : 119717 us
Elapsed time : 118556 us
Elapsed time : 118535 us
Elapsed time : 118737 us
Elapsed time : 118769 us
Elapsed time : 118321 us
Elapsed time : 118671 us
Elapsed time : 119015 us
Elapsed time : 119206 us
Elapsed time : 118477 us
Elapsed time : 118768 us
Elapsed time : 118738 us
Elapsed time : 119333 us
Elapsed time : 119564 us
Elapsed time : 119128 us
Elapsed time : 118329 us
Elapsed time : 118716 us
Elapsed time : 118677 us
Elapsed time : 118363 us
Elapsed time : 118009 us
Elapsed time : 119285 us
Elapsed time : 99289 us
Elapsed time : 51694 us
Elapsed time : 119092 us
Elapsed time : 118619 us
Elapsed time : 118083 us
Elapsed time : 118777 us
Elapsed time : 118684 us
Elapsed time : 119270 us
Elapsed time : 118664 us
Elapsed time : 118931 us
Elapsed time : 118540 us
Elapsed time : 118465 us
Elapsed time : 118925 us
Elapsed time : 118697 us
Elapsed time : 118367 us
Elapsed time : 118298 us
Elapsed time : 118993 us
Elapsed time : 119317 us
Elapsed time : 118735 us
Elapsed time : 118542 us
Elapsed time : 118419 us
Elapsed time : 118081 us
Elapsed time : 116872 us
Elapsed time : 52130 us
Elapsed time : 111615 us
Elapsed time : 118428 us
Elapsed time : 118210 us
Elapsed time : 118694 us
Elapsed time : 118565 us
Elapsed time : 119395 us
Elapsed time : 118917 us
Elapsed time : 118520 us
Elapsed time : 118378 us
Elapsed time : 117980 us
Elapsed time : 118937 us
Elapsed time : 118983 us
Elapsed time : 120064 us
Elapsed time : 119867 us
Elapsed time : 118720 us
Elapsed time : 118422 us
Elapsed time : 118473 us
Elapsed time : 118613 us
Elapsed time : 118463 us
Elapsed time : 119405 us
Elapsed time : 118431 us
Elapsed time : 118911 us
Elapsed time : 118381 us
Elapsed time : 118413 us
Elapsed time : 118244 us
Elapsed time : 118103 us
Elapsed time : 118560 us
Elapsed time : 117995 us
Elapsed time : 119021 us
Elapsed time : 113899 us
Elapsed time : 51913 us
Elapsed time : 113969 us
Elapsed time : 118528 us
Elapsed time : 118472 us
Elapsed time : 119240 us
Elapsed time : 118688 us
Elapsed time : 119135 us
Elapsed time : 118473 us
Elapsed time : 118378 us
Elapsed time : 119564 us
Elapsed time : 119037 us
Elapsed time : 119875 us
Elapsed time : 118568 us
Elapsed time : 118573 us
Elapsed time : 118551 us
Elapsed time : 119733 us
Elapsed time : 118889 us
Elapsed time : 119525 us
Elapsed time : 119554 us
Elapsed time : 119640 us
Elapsed time : 119547 us
Elapsed time : 119234 us
Elapsed time : 119716 us
Elapsed time : 118807 us
Elapsed time : 119933 us
Elapsed time : 118911 us
Elapsed time : 119214 us
Elapsed time : 119407 us
Elapsed time : 120298 us
Elapsed time : 118281 us
Elapsed time : 118364 us
Elapsed time : 118868 us
Elapsed time : 120022 us
Elapsed time : 118524 us
Elapsed time : 119486 us
Elapsed time : 118924 us
Elapsed time : 119434 us
Elapsed time : 118752 us
Elapsed time : 119216 us
Elapsed time : 118600 us
Elapsed time : 118691 us
Elapsed time : 119643 us
Elapsed time : 119411 us
Elapsed time : 119714 us
Elapsed time : 120075 us
Elapsed time : 119285 us
Elapsed time : 118356 us
Elapsed time : 119774 us
Elapsed time : 117945 us
Elapsed time : 118264 us
Elapsed time : 118570 us
Elapsed time : 118394 us
Elapsed time : 119894 us
Elapsed time : 118585 us
Elapsed time : 118441 us
Elapsed time : 118531 us
Elapsed time : 118954 us
Elapsed time : 118627 us
Elapsed time : 119292 us
Elapsed time : 118812 us
Elapsed time : 118507 us
Elapsed time : 119227 us
Elapsed time : 119274 us
Elapsed time : 118919 us
Elapsed time : 118814 us
Elapsed time : 118209 us
Elapsed time : 118068 us
Elapsed time : 117996 us
Elapsed time : 120151 us
Elapsed time : 118929 us
Elapsed time : 119526 us
Elapsed time : 118967 us
Elapsed time : 119264 us
Elapsed time : 118177 us
Elapsed time : 118718 us
Elapsed time : 118714 us
Elapsed time : 119627 us
Elapsed time : 118989 us
Elapsed time : 119581 us
Elapsed time : 119350 us
Elapsed time : 119151 us
Elapsed time : 119054 us
Elapsed time : 118983 us
Elapsed time : 118583 us
Elapsed time : 118058 us
Elapsed time : 118874 us
Elapsed time : 118833 us
Elapsed time : 118295 us
Elapsed time : 118799 us
Elapsed time : 117912 us
Elapsed time : 118934 us
Elapsed time : 118249 us
Elapsed time : 118583 us
Elapsed time : 119908 us
Elapsed time : 118474 us
Elapsed time : 119050 us
Elapsed time : 118532 us
Elapsed time : 118146 us
Elapsed time : 118649 us
Elapsed time : 118791 us
Elapsed time : 119143 us
Elapsed time : 118473 us
Elapsed time : 118628 us
Elapsed time : 118901 us
Elapsed time : 118830 us
Elapsed time : 118689 us
Elapsed time : 119666 us
Elapsed time : 118105 us
Elapsed time : 118253 us
Elapsed time : 118719 us
Elapsed time : 118752 us
Elapsed time : 118346 us
Elapsed time : 118705 us
Elapsed time : 118746 us
Elapsed time : 119802 us
Elapsed time : 118694 us
Elapsed time : 118356 us
Elapsed time : 119361 us
Elapsed time : 118690 us
Elapsed time : 118727 us
Elapsed time : 119139 us
Elapsed time : 118561 us
Elapsed time : 118319 us
Elapsed time : 119488 us
Elapsed time : 118914 us
Elapsed time : 118336 us
Elapsed time : 118558 us
Elapsed time : 119013 us
Elapsed time : 121322 us
Elapsed time : 118693 us
Elapsed time : 118608 us
Elapsed time : 119553 us
Elapsed time : 119826 us
Elapsed time : 118666 us
Elapsed time : 118175 us
Elapsed time : 119213 us
Elapsed time : 118222 us
Elapsed time : 119213 us
Elapsed time : 119350 us
Elapsed time : 118214 us
Elapsed time : 118566 us
Elapsed time : 118279 us
Elapsed time : 118671 us
Elapsed time : 118247 us
Elapsed time : 120152 us
Elapsed time : 119127 us
Elapsed time : 118767 us
Elapsed time : 118580 us
Elapsed time : 119780 us
Elapsed time : 119575 us
Elapsed time : 118227 us
Elapsed time : 120334 us
Elapsed time : 118869 us
Elapsed time : 119692 us
Elapsed time : 119525 us
Elapsed time : 119310 us
Elapsed time : 118551 us
Elapsed time : 119008 us
Elapsed time : 119885 us
Elapsed time : 119639 us
Elapsed time : 119562 us
Elapsed time : 119523 us
Elapsed time : 118760 us
Elapsed time : 118825 us
Elapsed time : 118515 us
Elapsed time : 119096 us
Elapsed time : 118188 us
Elapsed time : 119173 us
Elapsed time : 118075 us
Elapsed time : 119892 us
Elapsed time : 118812 us
Elapsed time : 119784 us
Elapsed time : 118524 us
Elapsed time : 119335 us
Elapsed time : 118652 us
Elapsed time : 118948 us
Elapsed time : 118973 us
Elapsed time : 118564 us
Elapsed time : 120119 us
Elapsed time : 118849 us
Elapsed time : 118157 us
Elapsed time : 118580 us
Elapsed time : 118522 us
Elapsed time : 119532 us
Elapsed time : 118946 us
Elapsed time : 118373 us
Elapsed time : 119158 us
Elapsed time : 118889 us
Elapsed time : 119123 us
Elapsed time : 118447 us
Elapsed time : 118092 us
Elapsed time : 117649 us
Elapsed time : 118693 us
Elapsed time : 118688 us
Elapsed time : 118365 us
Elapsed time : 119405 us
Elapsed time : 118751 us
Elapsed time : 118530 us
Elapsed time : 122647 us
Elapsed time : 118970 us
Elapsed time : 118189 us
Elapsed time : 118576 us
Elapsed time : 119067 us
Elapsed time : 118871 us
Elapsed time : 118538 us
Elapsed time : 119283 us
Elapsed time : 118588 us
Elapsed time : 118645 us
Elapsed time : 118058 us
Elapsed time : 118906 us
Elapsed time : 118629 us
Elapsed time : 118275 us
Elapsed time : 119028 us
Elapsed time : 118541 us
Elapsed time : 119964 us
Elapsed time : 118372 us
Elapsed time : 118530 us
Elapsed time : 118606 us
Elapsed time : 118209 us
Elapsed time : 118264 us
Elapsed time : 118449 us
Elapsed time : 118529 us
Elapsed time : 118572 us
Elapsed time : 118537 us
Elapsed time : 118331 us
Elapsed time : 118482 us
Elapsed time : 118025 us
Elapsed time : 118432 us
Elapsed time : 118392 us
Elapsed time : 118899 us
Elapsed time : 118626 us
Elapsed time : 119147 us
Elapsed time : 119382 us
Elapsed time : 118198 us
Elapsed time : 118186 us
Elapsed time : 118392 us
Elapsed time : 118631 us
Elapsed time : 91336 us
Elapsed time : 51817 us
Elapsed time : 118424 us
Elapsed time : 118946 us
Elapsed time : 118435 us
Elapsed time : 118301 us
Elapsed time : 118739 us
Elapsed time : 118708 us
Elapsed time : 118653 us
Elapsed time : 118775 us
Elapsed time : 118507 us
Elapsed time : 119400 us
Elapsed time : 118936 us
Elapsed time : 118808 us
Elapsed time : 119000 us
Elapsed time : 118197 us
Elapsed time : 118001 us
Elapsed time : 118598 us
Elapsed time : 118326 us
Elapsed time : 118760 us
Elapsed time : 118750 us
Elapsed time : 118675 us
Elapsed time : 117884 us
Elapsed time : 118162 us
Elapsed time : 118482 us
Elapsed time : 117825 us
Elapsed time : 118252 us
Elapsed time : 118109 us
Elapsed time : 118677 us
Elapsed time : 118578 us
Elapsed time : 118846 us
Elapsed time : 118509 us
Elapsed time : 119285 us
Elapsed time : 118727 us
Elapsed time : 118938 us
Elapsed time : 118039 us
Elapsed time : 118874 us
Elapsed time : 118294 us
Elapsed time : 118641 us
Elapsed time : 120076 us
Elapsed time : 119822 us
Elapsed time : 118695 us
Elapsed time : 123588 us
Elapsed time : 118824 us
Elapsed time : 118676 us
Elapsed time : 118945 us
Elapsed time : 119246 us
Elapsed time : 119267 us
Elapsed time : 118269 us
Elapsed time : 118532 us
Elapsed time : 119211 us
Elapsed time : 118341 us
Elapsed time : 119113 us
Elapsed time : 118772 us
Elapsed time : 118555 us
Elapsed time : 118483 us
Elapsed time : 118574 us
Elapsed time : 118724 us
Elapsed time : 118751 us
Elapsed time : 119633 us
Elapsed time : 118823 us
Elapsed time : 118320 us
Elapsed time : 119043 us
Elapsed time : 118942 us
Elapsed time : 119396 us
Elapsed time : 120113 us
Elapsed time : 118172 us
Elapsed time : 118381 us
Elapsed time : 118800 us
Elapsed time : 118535 us
Elapsed time : 120579 us
Elapsed time : 122946 us
Elapsed time : 119495 us
Elapsed time : 118661 us
Elapsed time : 117877 us
Elapsed time : 118255 us
Elapsed time : 118737 us
Elapsed time : 118635 us
Elapsed time : 119592 us
Elapsed time : 118731 us
Elapsed time : 118996 us
Elapsed time : 118481 us
Elapsed time : 117961 us
Elapsed time : 119657 us
Elapsed time : 118667 us
Elapsed time : 118359 us
Elapsed time : 118416 us
Elapsed time : 118540 us
Elapsed time : 118305 us
Elapsed time : 67741 us
Elapsed time : 67264 us
Elapsed time : 119746 us
Elapsed time : 118829 us
Elapsed time : 118543 us
Elapsed time : 118149 us
Elapsed time : 119496 us
Elapsed time : 118879 us
Elapsed time : 119686 us
Elapsed time : 119187 us
Elapsed time : 119382 us
Elapsed time : 119080 us
Elapsed time : 119095 us
Elapsed time : 117802 us
Elapsed time : 118873 us
Elapsed time : 118825 us
Elapsed time : 119239 us
Elapsed time : 118518 us
Elapsed time : 119395 us
Elapsed time : 118475 us
Elapsed time : 119046 us
Elapsed time : 118351 us
Elapsed time : 118712 us
Elapsed time : 118687 us
Elapsed time : 119194 us
Elapsed time : 118792 us
Elapsed time : 119248 us
Elapsed time : 119841 us
Elapsed time : 119333 us
Elapsed time : 119085 us
Elapsed time : 119398 us
Elapsed time : 118788 us
Elapsed time : 77612 us
Elapsed time : 54750 us
Elapsed time : 119220 us
Elapsed time : 118368 us
Elapsed time : 119850 us
Elapsed time : 118862 us
Elapsed time : 118928 us
Elapsed time : 118168 us
Elapsed time : 119658 us
Elapsed time : 118326 us
Elapsed time : 118074 us
Elapsed time : 119370 us
Elapsed time : 118529 us
Elapsed time : 119003 us
Elapsed time : 118757 us
Elapsed time : 118741 us
Elapsed time : 118574 us
Elapsed time : 119248 us
Elapsed time : 119013 us
Elapsed time : 118418 us
Elapsed time : 118610 us
Elapsed time : 118398 us
Elapsed time : 118961 us
Elapsed time : 119057 us
Elapsed time : 118658 us
Elapsed time : 106793 us
Elapsed time : 51391 us
Elapsed time : 119250 us
Elapsed time : 119312 us
Elapsed time : 118458 us
Elapsed time : 118331 us
Elapsed time : 118894 us
Elapsed time : 118483 us
Elapsed time : 118664 us
Elapsed time : 123686 us
Elapsed time : 118862 us
Elapsed time : 119840 us
Elapsed time : 118319 us
Elapsed time : 119162 us
Elapsed time : 118624 us
Elapsed time : 119565 us
Elapsed time : 118425 us
Elapsed time : 119378 us
Elapsed time : 119625 us
Elapsed time : 118555 us
Elapsed time : 118394 us
Elapsed time : 119404 us
Elapsed time : 58386 us
Elapsed time : 75818 us
Elapsed time : 118932 us
Elapsed time : 118207 us
Elapsed time : 118417 us
Elapsed time : 118557 us
Elapsed time : 119238 us
Elapsed time : 118692 us
Elapsed time : 118563 us
Elapsed time : 118618 us
Elapsed time : 117985 us
Elapsed time : 118041 us
Elapsed time : 118159 us
Elapsed time : 119856 us
Elapsed time : 119511 us
Elapsed time : 118899 us
Elapsed time : 118678 us
Elapsed time : 118628 us
Elapsed time : 119701 us
Elapsed time : 118604 us
Elapsed time : 119139 us
Elapsed time : 118525 us
Elapsed time : 118981 us
Elapsed time : 94367 us
Elapsed time : 51994 us
Elapsed time : 119210 us
Elapsed time : 118695 us
Elapsed time : 119003 us
Elapsed time : 118982 us
Elapsed time : 118625 us
Elapsed time : 118574 us
Elapsed time : 119954 us
Elapsed time : 118394 us
Elapsed time : 118869 us
Elapsed time : 118869 us
Elapsed time : 118864 us
Elapsed time : 118769 us
Elapsed time : 118323 us
Elapsed time : 118737 us
Elapsed time : 118050 us
Elapsed time : 118878 us
Elapsed time : 119031 us
Elapsed time : 118742 us
Elapsed time : 119700 us
Elapsed time : 119431 us
Elapsed time : 118343 us
Elapsed time : 118630 us
Elapsed time : 118622 us
Elapsed time : 118398 us
Elapsed time : 118307 us
Elapsed time : 119051 us
Elapsed time : 118041 us
Elapsed time : 118634 us
Elapsed time : 69700 us
Elapsed time : 62621 us
Elapsed time : 119019 us
Elapsed time : 118713 us
Elapsed time : 118827 us
Elapsed time : 118800 us
Elapsed time : 118376 us
Elapsed time : 118719 us
Elapsed time : 118514 us
Elapsed time : 117974 us
Elapsed time : 118336 us
Elapsed time : 118557 us
Elapsed time : 118528 us
Elapsed time : 118820 us
Elapsed time : 119447 us
Elapsed time : 118802 us
Elapsed time : 118536 us
Elapsed time : 118163 us
Elapsed time : 118321 us
Elapsed time : 118866 us
Elapsed time : 118605 us
Elapsed time : 118837 us
Elapsed time : 118521 us
Elapsed time : 118925 us
Elapsed time : 119020 us
Elapsed time : 119038 us
Elapsed time : 118542 us
Elapsed time : 118568 us
Elapsed time : 118135 us
Elapsed time : 119277 us
Elapsed time : 118978 us
Elapsed time : 118511 us
Elapsed time : 118623 us
Elapsed time : 118673 us
Elapsed time : 119972 us
Elapsed time : 118619 us
Elapsed time : 118696 us
Elapsed time : 118109 us
Elapsed time : 119561 us
Elapsed time : 118542 us
Elapsed time : 52140 us
Elapsed time : 87006 us
Elapsed time : 118794 us
Elapsed time : 118757 us
Elapsed time : 118579 us
Elapsed time : 118516 us
Elapsed time : 118768 us
Elapsed time : 118585 us
Elapsed time : 120227 us
Elapsed time : 118135 us
Elapsed time : 119492 us
Elapsed time : 118341 us
Elapsed time : 119252 us
Elapsed time : 119031 us
Elapsed time : 118859 us
Elapsed time : 119109 us
Elapsed time : 118919 us
Elapsed time : 118237 us
Elapsed time : 118185 us
Elapsed time : 118457 us
Elapsed time : 118237 us
Elapsed time : 118524 us
Elapsed time : 118683 us
Elapsed time : 118982 us
Elapsed time : 118378 us
Elapsed time : 119022 us
Elapsed time : 119814 us
Elapsed time : 118535 us
Elapsed time : 118900 us
Elapsed time : 118623 us
Elapsed time : 119480 us
Elapsed time : 118130 us
Elapsed time : 120310 us
Elapsed time : 118490 us
Elapsed time : 119258 us
Elapsed time : 118153 us
Elapsed time : 118610 us
Elapsed time : 118673 us
Elapsed time : 118069 us
Elapsed time : 118658 us
Elapsed time : 118460 us
Elapsed time : 120480 us
Elapsed time : 119038 us
Elapsed time : 119716 us
Elapsed time : 117703 us
Elapsed time : 119605 us
Elapsed time : 118516 us
Elapsed time : 118692 us
Elapsed time : 119864 us
Elapsed time : 118483 us
Elapsed time : 119120 us
Elapsed time : 118812 us
Elapsed time : 118900 us
Elapsed time : 120046 us
Elapsed time : 118726 us
Elapsed time : 119541 us
Elapsed time : 118526 us
Elapsed time : 119450 us
Elapsed time : 118493 us
Elapsed time : 118477 us
Elapsed time : 119182 us
Elapsed time : 118734 us
Elapsed time : 119024 us
Elapsed time : 118618 us
Elapsed time : 118775 us
Elapsed time : 119157 us
Elapsed time : 118432 us
Elapsed time : 83404 us
Elapsed time : 52109 us
Elapsed time : 118663 us
Elapsed time : 118710 us
Elapsed time : 121960 us
Elapsed time : 118211 us
Elapsed time : 117878 us
Elapsed time : 119275 us
Elapsed time : 118800 us
Elapsed time : 118338 us
Elapsed time : 118905 us
Elapsed time : 118720 us
Elapsed time : 118599 us
Elapsed time : 118727 us
Elapsed time : 118165 us
Elapsed time : 121195 us
Elapsed time : 118312 us
Elapsed time : 118454 us
Elapsed time : 118693 us
Elapsed time : 118985 us
Elapsed time : 118641 us
Elapsed time : 118681 us
Elapsed time : 51953 us
Elapsed time : 103668 us
Elapsed time : 118613 us
Elapsed time : 119005 us
Elapsed time : 118944 us
Elapsed time : 119192 us
Elapsed time : 118379 us
Elapsed time : 118516 us
Elapsed time : 121171 us
Elapsed time : 118859 us
Elapsed time : 118568 us
Elapsed time : 119266 us
Elapsed time : 118988 us
Elapsed time : 118923 us
Elapsed time : 118909 us
Elapsed time : 118110 us
Elapsed time : 118534 us
Elapsed time : 118301 us
Elapsed time : 118221 us
Elapsed time : 119719 us
Elapsed time : 118541 us
Elapsed time : 118323 us
Elapsed time : 118256 us
Elapsed time : 119072 us
Elapsed time : 118505 us
Elapsed time : 118411 us
Elapsed time : 119192 us
Elapsed time : 118850 us
Elapsed time : 118756 us
Elapsed time : 118076 us
Elapsed time : 119338 us
Elapsed time : 118488 us
Elapsed time : 118742 us
Elapsed time : 118505 us
Elapsed time : 118336 us
Elapsed time : 118498 us
Elapsed time : 119823 us
Elapsed time : 118412 us
Elapsed time : 120388 us
Elapsed time : 119110 us
Elapsed time : 118963 us
Elapsed time : 118158 us
Elapsed time : 118939 us
Elapsed time : 119556 us
Elapsed time : 118525 us
Elapsed time : 119187 us
Elapsed time : 118924 us
Elapsed time : 119660 us
Elapsed time : 118631 us
Elapsed time : 119211 us
Elapsed time : 119114 us
Elapsed time : 119737 us
Elapsed time : 118287 us
Elapsed time : 119529 us
Elapsed time : 118708 us
Elapsed time : 119628 us
Elapsed time : 118413 us
Elapsed time : 118590 us
Elapsed time : 117802 us
Elapsed time : 118569 us
Elapsed time : 118135 us
Elapsed time : 120736 us
Elapsed time : 119146 us
Elapsed time : 118714 us
Elapsed time : 118048 us
Elapsed time : 118557 us
Elapsed time : 118358 us
Elapsed time : 118160 us
Elapsed time : 119019 us
Elapsed time : 119743 us
Elapsed time : 118915 us
Elapsed time : 97065 us
Elapsed time : 51773 us
Elapsed time : 119989 us
Elapsed time : 118400 us
Elapsed time : 118413 us
Elapsed time : 118520 us
Elapsed time : 118709 us
Elapsed time : 119104 us
Elapsed time : 118337 us
Elapsed time : 123252 us
Elapsed time : 118288 us
Elapsed time : 118779 us
Elapsed time : 119300 us
Elapsed time : 118104 us
Elapsed time : 118252 us
Elapsed time : 119433 us
Elapsed time : 118649 us
Elapsed time : 118526 us
Elapsed time : 118378 us
Elapsed time : 118039 us
Elapsed time : 117925 us
Elapsed time : 118047 us
Elapsed time : 108562 us
Elapsed time : 51888 us
Elapsed time : 118757 us
Elapsed time : 118205 us
Elapsed time : 122623 us
Elapsed time : 118507 us
Elapsed time : 118726 us
Elapsed time : 118348 us
Elapsed time : 118778 us
Elapsed time : 118228 us
Elapsed time : 118527 us
Elapsed time : 118558 us
Elapsed time : 118453 us
Elapsed time : 118030 us
Elapsed time : 118381 us
Elapsed time : 118036 us
Elapsed time : 118803 us
Elapsed time : 118413 us
Elapsed time : 118577 us
Elapsed time : 118626 us
Elapsed time : 118205 us
Elapsed time : 118276 us
Elapsed time : 119962 us
Elapsed time : 118316 us
Elapsed time : 118581 us
Elapsed time : 118674 us
Elapsed time : 103068 us
Elapsed time : 52019 us
Elapsed time : 118624 us
Elapsed time : 118493 us
Elapsed time : 119356 us
Elapsed time : 118116 us
Elapsed time : 119351 us
Elapsed time : 118792 us
Elapsed time : 118637 us
Elapsed time : 118535 us
Elapsed time : 118751 us
Elapsed time : 118833 us
Elapsed time : 119947 us
Elapsed time : 118352 us
Elapsed time : 119495 us
Elapsed time : 118064 us
Elapsed time : 119463 us
Elapsed time : 118555 us
Elapsed time : 119534 us
Elapsed time : 118271 us
Elapsed time : 118934 us
Elapsed time : 118272 us
Elapsed time : 118233 us
Elapsed time : 118260 us
Elapsed time : 119339 us
Elapsed time : 119283 us
Elapsed time : 119052 us
Elapsed time : 119059 us
Elapsed time : 118700 us
Elapsed time : 119224 us
Elapsed time : 119284 us
Elapsed time : 121675 us
Elapsed time : 119303 us
Elapsed time : 119662 us
Elapsed time : 119043 us
Elapsed time : 118971 us
Elapsed time : 119721 us
Elapsed time : 119084 us
Elapsed time : 118588 us
Elapsed time : 118197 us
Elapsed time : 119065 us
Elapsed time : 118634 us
Elapsed time : 118306 us
Elapsed time : 118587 us
Elapsed time : 118254 us
Elapsed time : 118904 us
Elapsed time : 118592 us
Elapsed time : 117838 us
Elapsed time : 118724 us
Elapsed time : 118888 us
Elapsed time : 118637 us
Elapsed time : 119058 us
Elapsed time : 118272 us
Elapsed time : 119155 us
Elapsed time : 118698 us
Elapsed time : 118058 us
Elapsed time : 118694 us
Elapsed time : 118597 us
Elapsed time : 118505 us
Elapsed time : 119089 us
Elapsed time : 118814 us
Elapsed time : 107821 us
Elapsed time : 52196 us
Elapsed time : 118856 us
Elapsed time : 119172 us
Elapsed time : 118538 us
Elapsed time : 119530 us
Elapsed time : 118507 us
Elapsed time : 118664 us
Elapsed time : 118566 us
Elapsed time : 118735 us
Elapsed time : 118831 us
Elapsed time : 118465 us
Elapsed time : 118219 us
Elapsed time : 118483 us
Elapsed time : 118019 us
Elapsed time : 118856 us
Elapsed time : 118378 us
Elapsed time : 120446 us
Elapsed time : 119276 us
Elapsed time : 119401 us
Elapsed time : 118183 us
Elapsed time : 118268 us
Elapsed time : 60760 us
Elapsed time : 73544 us
Elapsed time : 118583 us
Elapsed time : 118106 us
Elapsed time : 118548 us
Elapsed time : 119731 us
Elapsed time : 119220 us
Elapsed time : 118938 us
Elapsed time : 117656 us
Elapsed time : 118822 us
Elapsed time : 118226 us
Elapsed time : 117885 us
Elapsed time : 119015 us
Elapsed time : 118491 us
Elapsed time : 118346 us
Elapsed time : 118819 us
Elapsed time : 118253 us
Elapsed time : 119407 us
Elapsed time : 118190 us
Elapsed time : 123361 us
Elapsed time : 118149 us
Elapsed time : 118607 us
Elapsed time : 118700 us
Elapsed time : 119195 us
Elapsed time : 118536 us
Elapsed time : 118774 us
Elapsed time : 118431 us
Elapsed time : 117933 us
Elapsed time : 118778 us
Elapsed time : 118542 us
Elapsed time : 118743 us
Elapsed time : 119067 us
Elapsed time : 118521 us
Elapsed time : 119558 us
Elapsed time : 118096 us
Elapsed time : 118391 us
Elapsed time : 118468 us
Elapsed time : 119023 us
Elapsed time : 118096 us
Elapsed time : 118852 us
Elapsed time : 118741 us
Elapsed time : 118799 us
Elapsed time : 118291 us
Elapsed time : 117893 us
Elapsed time : 118134 us
Elapsed time : 118835 us
Elapsed time : 118435 us
Elapsed time : 118821 us
Elapsed time : 118007 us
Elapsed time : 118998 us
Elapsed time : 118153 us
Elapsed time : 119043 us
Elapsed time : 118451 us
Elapsed time : 118280 us
Elapsed time : 84966 us
Elapsed time : 52077 us
Elapsed time : 119014 us
Elapsed time : 122038 us
Elapsed time : 118307 us
Elapsed time : 119595 us
Elapsed time : 117939 us
Elapsed time : 123668 us
Elapsed time : 118396 us
Elapsed time : 119185 us
Elapsed time : 120081 us
Elapsed time : 118783 us
Elapsed time : 118673 us
Elapsed time : 118619 us
Elapsed time : 118055 us
Elapsed time : 117981 us
Elapsed time : 119645 us
Elapsed time : 118543 us
Elapsed time : 119161 us
Elapsed time : 119926 us
Elapsed time : 118620 us
Elapsed time : 120061 us
Elapsed time : 118895 us
Elapsed time : 108535 us
Elapsed time : 52203 us
Elapsed time : 118495 us
Elapsed time : 119365 us
Elapsed time : 118283 us
Elapsed time : 118482 us
Elapsed time : 118742 us
Elapsed time : 118333 us
Elapsed time : 118910 us
Elapsed time : 118911 us
Elapsed time : 118450 us
Elapsed time : 118352 us
Elapsed time : 119089 us
Elapsed time : 118996 us
Elapsed time : 119481 us
Elapsed time : 123118 us
Elapsed time : 119659 us
Elapsed time : 118857 us
Elapsed time : 118654 us
Elapsed time : 118445 us
Elapsed time : 118923 us
Elapsed time : 118088 us
Elapsed time : 119708 us
Elapsed time : 119365 us
Elapsed time : 118327 us
Elapsed time : 118560 us
Elapsed time : 118727 us
Elapsed time : 118780 us
Elapsed time : 118543 us
Elapsed time : 118534 us
Elapsed time : 120257 us
Elapsed time : 118926 us
Elapsed time : 118330 us
Elapsed time : 118384 us
Elapsed time : 119390 us
Elapsed time : 68390 us
Elapsed time : 65879 us
Elapsed time : 118944 us
Elapsed time : 119007 us
Elapsed time : 118715 us
