[	0.0000000000000000e+00	1.1062061309814453e+01	-1.1556347601151096e-01	-3.9748399500970186e+00	]
[	1.0000000000000001e-01	1.1062061309814453e+01	3.7879863669424481e+00	-8.4617019863409271e-01	]
[	2.0000000000000001e-01	1.1062061309814453e+01	-4.0262603759765625e+00	-4.7106477053094253e-01	]
[	2.9999999999999999e-01	1.1062061309814453e+01	-2.5291857479125381e+00	3.3303866129975015e+00	]
[	4.0000000000000002e-01	1.1062061309814453e+01	1.7654689156633916e+00	3.7834777420398416e+00	]
[	5.0000000000000000e-01	1.1062061309814453e+01	3.2707096832183695e+00	2.5971195229529984e+00	]
[	5.9999999999999998e-01	1.1062061309814453e+01	-1.9554678922257658e+00	-3.3485324199274129e+00	]
[	7.0000000000000007e-01	1.1062061309814453e+01	-2.4372630216891382e+00	-3.0159873290021273e+00	]
[	8.0000000000000004e-01	1.1062061309814453e+01	1.8266727896873622e+00	3.7490909319346541e+00	]
[	8.9999999999999991e-01	1.1062061309814453e+01	3.9468404247765365e+00	1.3464541019426348e+00	]
[	1.0000000000000000e+00	1.1062061309814453e+01	-3.7900783177048281e+00	8.1940782437893800e-01	]
[	1.1000000000000001e+00	1.1062061309814453e+01	3.4665744771627254e+00	2.3180561168963951e+00	]
[	1.2000000000000000e+00	1.1062061309814453e+01	-3.6818371163815731e+00	-1.2166298950583578e+00	]
[	1.3000000000000000e+00	1.1062061309814453e+01	-3.6217932082252999e+00	-1.3852570180827370e+00	]
[	1.4000000000000001e+00	1.1062061309814453e+01	3.9512059040422520e+00	1.0701458300743565e+00	]
[	1.5000000000000000e+00	1.1062061309814453e+01	3.5675958280172213e+00	1.5193483884898467e+00	]
[	1.6000000000000001e+00	1.1062061309814453e+01	-1.7090952968450615e+00	-3.5187326089334432e+00	]
[	1.7000000000000002e+00	1.1062061309814453e+01	-3.3157268460732001e+00	-2.0647717661167011e+00	]
[	1.7999999999999998e+00	1.1062061309814453e+01	4.0262603759765625e+00	2.2515025095036090e-01	]
[	1.8999999999999999e+00	1.1062061309814453e+01	-3.7345943014088787e+00	-1.0441194620753715e+00	]
[	2.0000000000000000e+00	1.1062061309814453e+01	-1.3377130219655460e+00	3.7153513515174477e+00	]
[	2.1000000000000001e+00	1.1062061309814453e+01	3.8778217315264869e+00	-6.7049977803633892e-02	]
[	2.2000000000000002e+00	1.1062061309814453e+01	-3.6764109493040964e+00	-1.9684004134947577e+00	]
[	2.3000000000000003e+00	1.1062061309814453e+01	2.8232551916204418e+00	2.6581508018482420e+00	]
[	2.3999999999999999e+00	1.1062061309814453e+01	3.2764288457632933e+00	2.0742627950686283e+00	]
[	2.5000000000000000e+00	1.1062061309814453e+01	-4.0262603759765625e+00	-6.5729713773658360e-01	]
[	2.6000000000000001e+00	1.1062061309814453e+01	2.3805614957685850e+00	-3.2287623903878591e+00	]
[	2.7000000000000002e+00	1.1062061309814453e+01	-2.4549696653501543e+00	-3.0015692004827019e+00	]
[	2.8000000000000003e+00	1.1062061309814453e+01	-1.0064454284771709e+00	-4.0064466632330786e+00	]
[	2.8999999999999999e+00	1.1062061309814453e+01	3.2700891646069961e+00	-2.0839857995926674e+00	]
[	3.0000000000000000e+00	1.1062061309814453e+01	-3.2186911599231034e+00	2.6019286826368457e+00	]
[	3.1000000000000001e+00	1.1062061309814453e+01	-1.6896024922179955e+00	3.8135430119862117e+00	]
[	3.2000000000000002e+00	1.1062061309814453e+01	1.4721203683583854e+00	3.5877130237408745e+00	]
[	3.3000000000000003e+00	1.1062061309814453e+01	3.0452897842151194e+00	2.4173991578527745e+00	]
[	3.4000000000000004e+00	1.1062061309814453e+01	-9.7142249990117513e-01	-3.9489321365510794e+00	]
[	3.5000000000000000e+00	1.1062061309814453e+01	-6.4253910169485873e-01	4.0262603759765625e+00	]
[	3.5999999999999996e+00	1.1062061309814453e+01	-1.1123606362883443e+00	-3.8793523260956166e+00	]
[	3.7000000000000002e+00	1.1062061309814453e+01	1.6698420137428758e+00	3.4997826058566144e+00	]
[	3.7999999999999998e+00	1.1062061309814453e+01	-1.3125481349249559e+00	-3.9582449619324698e+00	]
[	3.9000000000000004e+00	1.1062061309814453e+01	3.4855849612901637e+00	-2.2937568998287925e+00	]
[	4.0000000000000000e+00	1.1062061309814453e+01	-1.7296390452457171e+00	-3.7946978110585401e+00	]
[	4.0999999999999996e+00	1.1062061309814453e+01	-2.0127159366813920e+00	3.3493642115973414e+00	]
[	4.2000000000000002e+00	1.1062061309814453e+01	-1.4012919903520260e+00	-3.7137469649961328e+00	]
[	4.2999999999999998e+00	1.1062061309814453e+01	1.5875830784378395e+00	3.8562056397833029e+00	]
[	4.4000000000000004e+00	1.1062061309814453e+01	1.3576272134220360e+00	3.9247125507633744e+00	]
[	4.5000000000000000e+00	1.1062061309814453e+01	2.6884058461568285e+00	3.1879716473723660e+00	]
[	4.6000000000000005e+00	1.1062061309814453e+01	-1.8787129429073162e+00	-3.3921281614002119e+00	]
[	4.6999999999999993e+00	1.1062061309814453e+01	-2.2725005867693513e+00	-3.4994696828738814e+00	]
[	4.7999999999999998e+00	1.1701100093790787e+01	2.4825743455685381e-01	6.5436937073366153e-01	]
[	4.9000000000000004e+00	1.1719333417184981e+01	2.4392395028443120e-01	5.5270436871180266e-02	]
[	5.0000000000000000e+00	1.1719333417184981e+01	2.4392395028443120e-01	5.5270436871180266e-02	]
