Elapsed time : 11336 us
Elapsed time : 25920 us
Elapsed time : 25907 us
Elapsed time : 25783 us
Elapsed time : 25707 us
Elapsed time : 25555 us
Elapsed time : 25872 us
Elapsed time : 25572 us
Elapsed time : 25619 us
Elapsed time : 25955 us
Elapsed time : 26156 us
Elapsed time : 25640 us
Elapsed time : 25708 us
Elapsed time : 25816 us
Elapsed time : 25907 us
Elapsed time : 25455 us
Elapsed time : 25858 us
Elapsed time : 25635 us
Elapsed time : 25970 us
Elapsed time : 26117 us
Elapsed time : 26143 us
Elapsed time : 26174 us
Elapsed time : 25834 us
Elapsed time : 25593 us
Elapsed time : 25679 us
Elapsed time : 25653 us
Elapsed time : 25760 us
Elapsed time : 25867 us
Elapsed time : 25618 us
Elapsed time : 25660 us
Elapsed time : 25819 us
Elapsed time : 25591 us
Elapsed time : 25668 us
Elapsed time : 25840 us
Elapsed time : 25598 us
Elapsed time : 25714 us
Elapsed time : 25632 us
Elapsed time : 25908 us
Elapsed time : 26071 us
Elapsed time : 25699 us
Elapsed time : 25776 us
Elapsed time : 25753 us
Elapsed time : 25634 us
Elapsed time : 25603 us
Elapsed time : 25953 us
Elapsed time : 25641 us
Elapsed time : 25789 us
Elapsed time : 25607 us
Elapsed time : 25714 us
Elapsed time : 25640 us
Elapsed time : 25710 us
Elapsed time : 26146 us
Elapsed time : 25640 us
Elapsed time : 25889 us
Elapsed time : 26036 us
Elapsed time : 25704 us
Elapsed time : 25988 us
Elapsed time : 25699 us
Elapsed time : 25706 us
Elapsed time : 25694 us
Elapsed time : 25688 us
Elapsed time : 11227 us
Elapsed time : 11135 us
Elapsed time : 11226 us
Elapsed time : 11171 us
Elapsed time : 25848 us
Elapsed time : 25676 us
Elapsed time : 25567 us
Elapsed time : 25643 us
Elapsed time : 25702 us
Elapsed time : 25564 us
Elapsed time : 25812 us
Elapsed time : 25588 us
Elapsed time : 25669 us
Elapsed time : 25739 us
Elapsed time : 25664 us
Elapsed time : 25696 us
Elapsed time : 25768 us
Elapsed time : 25757 us
Elapsed time : 25818 us
Elapsed time : 25667 us
Elapsed time : 25856 us
Elapsed time : 25675 us
Elapsed time : 25809 us
Elapsed time : 26155 us
Elapsed time : 25756 us
Elapsed time : 25840 us
Elapsed time : 25749 us
Elapsed time : 25592 us
Elapsed time : 25948 us
Elapsed time : 25746 us
Elapsed time : 25483 us
Elapsed time : 26625 us
Elapsed time : 25783 us
Elapsed time : 25784 us
Elapsed time : 25810 us
Elapsed time : 25585 us
Elapsed time : 25723 us
Elapsed time : 25693 us
Elapsed time : 25616 us
Elapsed time : 25921 us
Elapsed time : 25855 us
Elapsed time : 25792 us
Elapsed time : 25721 us
Elapsed time : 25685 us
Elapsed time : 25658 us
Elapsed time : 25681 us
Elapsed time : 25610 us
Elapsed time : 25690 us
Elapsed time : 25434 us
Elapsed time : 25780 us
Elapsed time : 25744 us
Elapsed time : 25668 us
Elapsed time : 25735 us
Elapsed time : 25755 us
Elapsed time : 25630 us
Elapsed time : 25761 us
Elapsed time : 25630 us
Elapsed time : 25713 us
Elapsed time : 25870 us
Elapsed time : 25790 us
Elapsed time : 25782 us
Elapsed time : 25966 us
Elapsed time : 25658 us
Elapsed time : 25755 us
Elapsed time : 25767 us
Elapsed time : 25637 us
Elapsed time : 25822 us
Elapsed time : 25541 us
Elapsed time : 25655 us
Elapsed time : 25573 us
Elapsed time : 25645 us
Elapsed time : 25696 us
Elapsed time : 25562 us
Elapsed time : 25963 us
Elapsed time : 25822 us
Elapsed time : 25801 us
Elapsed time : 25855 us
Elapsed time : 25890 us
Elapsed time : 25732 us
Elapsed time : 25920 us
Elapsed time : 25646 us
Elapsed time : 25857 us
Elapsed time : 25789 us
Elapsed time : 25709 us
Elapsed time : 25971 us
Elapsed time : 25915 us
Elapsed time : 26405 us
Elapsed time : 25978 us
Elapsed time : 25529 us
Elapsed time : 25779 us
Elapsed time : 25764 us
Elapsed time : 25415 us
Elapsed time : 25833 us
Elapsed time : 25536 us
Elapsed time : 25620 us
Elapsed time : 25849 us
Elapsed time : 25558 us
Elapsed time : 25744 us
Elapsed time : 25719 us
Elapsed time : 25628 us
Elapsed time : 25702 us
Elapsed time : 25740 us
Elapsed time : 25746 us
Elapsed time : 25792 us
Elapsed time : 26202 us
Elapsed time : 25634 us
Elapsed time : 26073 us
Elapsed time : 25566 us
Elapsed time : 25849 us
Elapsed time : 25702 us
Elapsed time : 25681 us
Elapsed time : 25616 us
Elapsed time : 25722 us
Elapsed time : 25949 us
Elapsed time : 25632 us
Elapsed time : 25659 us
Elapsed time : 26110 us
Elapsed time : 25458 us
Elapsed time : 25738 us
Elapsed time : 25837 us
Elapsed time : 25802 us
Elapsed time : 25721 us
Elapsed time : 26021 us
Elapsed time : 25606 us
Elapsed time : 25692 us
Elapsed time : 25833 us
Elapsed time : 25811 us
Elapsed time : 25713 us
Elapsed time : 25801 us
Elapsed time : 25727 us
Elapsed time : 25600 us
Elapsed time : 25706 us
Elapsed time : 25830 us
Elapsed time : 25676 us
Elapsed time : 25589 us
Elapsed time : 25659 us
Elapsed time : 25632 us
Elapsed time : 25921 us
Elapsed time : 25726 us
Elapsed time : 26013 us
Elapsed time : 25813 us
Elapsed time : 25743 us
Elapsed time : 25762 us
Elapsed time : 25685 us
Elapsed time : 25671 us
Elapsed time : 25799 us
Elapsed time : 25791 us
Elapsed time : 25633 us
Elapsed time : 25753 us
Elapsed time : 25621 us
Elapsed time : 25980 us
Elapsed time : 25681 us
Elapsed time : 25683 us
Elapsed time : 25824 us
Elapsed time : 25835 us
Elapsed time : 25626 us
Elapsed time : 25865 us
Elapsed time : 25517 us
Elapsed time : 25751 us
Elapsed time : 25743 us
Elapsed time : 25648 us
Elapsed time : 25748 us
Elapsed time : 25665 us
Elapsed time : 25635 us
Elapsed time : 25684 us
Elapsed time : 26017 us
Elapsed time : 25793 us
Elapsed time : 25577 us
Elapsed time : 25831 us
Elapsed time : 25860 us
Elapsed time : 25556 us
Elapsed time : 25626 us
Elapsed time : 25844 us
Elapsed time : 25687 us
Elapsed time : 25888 us
Elapsed time : 25528 us
Elapsed time : 25758 us
Elapsed time : 26329 us
Elapsed time : 25506 us
Elapsed time : 25652 us
Elapsed time : 25962 us
Elapsed time : 25454 us
Elapsed time : 25897 us
Elapsed time : 25706 us
Elapsed time : 25570 us
Elapsed time : 25882 us
Elapsed time : 25844 us
Elapsed time : 25642 us
Elapsed time : 25675 us
Elapsed time : 25716 us
Elapsed time : 25751 us
Elapsed time : 25633 us
Elapsed time : 25589 us
Elapsed time : 25845 us
Elapsed time : 25505 us
Elapsed time : 25645 us
Elapsed time : 26046 us
Elapsed time : 25518 us
Elapsed time : 25660 us
Elapsed time : 25926 us
Elapsed time : 25636 us
Elapsed time : 25696 us
Elapsed time : 25512 us
Elapsed time : 25597 us
Elapsed time : 25769 us
Elapsed time : 25655 us
Elapsed time : 25762 us
Elapsed time : 25638 us
Elapsed time : 25675 us
Elapsed time : 26160 us
Elapsed time : 25431 us
Elapsed time : 25683 us
Elapsed time : 26102 us
Elapsed time : 25608 us
Elapsed time : 26262 us
Elapsed time : 25934 us
Elapsed time : 25750 us
Elapsed time : 26064 us
Elapsed time : 25906 us
Elapsed time : 25901 us
Elapsed time : 25790 us
Elapsed time : 25609 us
Elapsed time : 25939 us
Elapsed time : 25781 us
Elapsed time : 26913 us
Elapsed time : 25679 us
Elapsed time : 25786 us
Elapsed time : 25589 us
Elapsed time : 25580 us
Elapsed time : 25862 us
Elapsed time : 25780 us
Elapsed time : 25684 us
Elapsed time : 26259 us
Elapsed time : 25600 us
Elapsed time : 25574 us
Elapsed time : 25670 us
Elapsed time : 25729 us
Elapsed time : 25837 us
Elapsed time : 25803 us
Elapsed time : 25501 us
Elapsed time : 25973 us
Elapsed time : 25841 us
Elapsed time : 25945 us
Elapsed time : 26053 us
Elapsed time : 25704 us
Elapsed time : 25892 us
Elapsed time : 25700 us
Elapsed time : 25688 us
Elapsed time : 26945 us
Elapsed time : 26034 us
Elapsed time : 26762 us
Elapsed time : 25610 us
Elapsed time : 25855 us
Elapsed time : 25368 us
Elapsed time : 25651 us
Elapsed time : 25618 us
Elapsed time : 25779 us
Elapsed time : 25866 us
Elapsed time : 25747 us
Elapsed time : 25737 us
Elapsed time : 25546 us
Elapsed time : 25845 us
Elapsed time : 25952 us
Elapsed time : 25563 us
Elapsed time : 25907 us
Elapsed time : 25730 us
Elapsed time : 25782 us
Elapsed time : 25541 us
Elapsed time : 25818 us
Elapsed time : 25623 us
Elapsed time : 25776 us
Elapsed time : 25665 us
Elapsed time : 26282 us
Elapsed time : 25553 us
Elapsed time : 25716 us
Elapsed time : 26084 us
Elapsed time : 25509 us
Elapsed time : 25912 us
Elapsed time : 25749 us
Elapsed time : 25723 us
Elapsed time : 25638 us
Elapsed time : 26745 us
Elapsed time : 25467 us
Elapsed time : 25884 us
Elapsed time : 25738 us
Elapsed time : 25717 us
Elapsed time : 25679 us
Elapsed time : 25870 us
Elapsed time : 26056 us
Elapsed time : 25652 us
Elapsed time : 25647 us
Elapsed time : 25745 us
Elapsed time : 25738 us
Elapsed time : 25656 us
Elapsed time : 26780 us
Elapsed time : 25554 us
Elapsed time : 25700 us
Elapsed time : 25714 us
Elapsed time : 25904 us
Elapsed time : 25893 us
Elapsed time : 25734 us
Elapsed time : 25660 us
Elapsed time : 25746 us
Elapsed time : 25671 us
Elapsed time : 25713 us
Elapsed time : 26286 us
Elapsed time : 25464 us
Elapsed time : 25887 us
Elapsed time : 25582 us
Elapsed time : 25792 us
Elapsed time : 25817 us
Elapsed time : 25454 us
Elapsed time : 25864 us
Elapsed time : 25778 us
Elapsed time : 25520 us
Elapsed time : 25833 us
Elapsed time : 25686 us
Elapsed time : 25717 us
Elapsed time : 25971 us
Elapsed time : 25619 us
Elapsed time : 25644 us
Elapsed time : 25797 us
Elapsed time : 25799 us
Elapsed time : 25980 us
Elapsed time : 25682 us
Elapsed time : 25700 us
Elapsed time : 25774 us
Elapsed time : 25668 us
Elapsed time : 25757 us
Elapsed time : 25572 us
Elapsed time : 25711 us
Elapsed time : 25952 us
Elapsed time : 25592 us
Elapsed time : 25827 us
Elapsed time : 25829 us
Elapsed time : 25676 us
Elapsed time : 25813 us
Elapsed time : 25624 us
Elapsed time : 25550 us
Elapsed time : 25874 us
Elapsed time : 25637 us
Elapsed time : 26385 us
Elapsed time : 25913 us
Elapsed time : 25676 us
Elapsed time : 25700 us
Elapsed time : 25566 us
Elapsed time : 25682 us
Elapsed time : 25846 us
Elapsed time : 25823 us
Elapsed time : 25642 us
Elapsed time : 25774 us
Elapsed time : 25537 us
Elapsed time : 25843 us
Elapsed time : 25546 us
Elapsed time : 25597 us
Elapsed time : 25846 us
Elapsed time : 25835 us
Elapsed time : 25687 us
Elapsed time : 25636 us
Elapsed time : 25741 us
Elapsed time : 25603 us
Elapsed time : 25446 us
Elapsed time : 26028 us
Elapsed time : 25815 us
Elapsed time : 25604 us
Elapsed time : 25547 us
Elapsed time : 25978 us
Elapsed time : 25799 us
Elapsed time : 25721 us
Elapsed time : 25806 us
Elapsed time : 26229 us
Elapsed time : 25800 us
Elapsed time : 25824 us
Elapsed time : 25597 us
Elapsed time : 25700 us
Elapsed time : 25569 us
Elapsed time : 25923 us
Elapsed time : 25756 us
Elapsed time : 25874 us
Elapsed time : 25727 us
Elapsed time : 25717 us
Elapsed time : 25713 us
Elapsed time : 25675 us
Elapsed time : 25677 us
Elapsed time : 25721 us
Elapsed time : 25576 us
Elapsed time : 25764 us
Elapsed time : 25742 us
Elapsed time : 25667 us
Elapsed time : 25574 us
Elapsed time : 25846 us
Elapsed time : 25922 us
Elapsed time : 25941 us
Elapsed time : 25608 us
Elapsed time : 25929 us
Elapsed time : 25681 us
Elapsed time : 26171 us
Elapsed time : 25772 us
Elapsed time : 25577 us
Elapsed time : 25752 us
Elapsed time : 25689 us
Elapsed time : 25630 us
Elapsed time : 25732 us
Elapsed time : 25705 us
Elapsed time : 25722 us
Elapsed time : 26107 us
Elapsed time : 25418 us
Elapsed time : 25633 us
Elapsed time : 25934 us
Elapsed time : 25631 us
Elapsed time : 25636 us
Elapsed time : 25755 us
Elapsed time : 25558 us
Elapsed time : 25907 us
Elapsed time : 25774 us
Elapsed time : 25813 us
Elapsed time : 25721 us
Elapsed time : 25650 us
Elapsed time : 25903 us
Elapsed time : 25626 us
Elapsed time : 25596 us
Elapsed time : 25861 us
Elapsed time : 25771 us
Elapsed time : 25653 us
Elapsed time : 25887 us
Elapsed time : 25565 us
Elapsed time : 25926 us
Elapsed time : 25649 us
Elapsed time : 25602 us
Elapsed time : 25702 us
Elapsed time : 25639 us
Elapsed time : 25888 us
Elapsed time : 25912 us
Elapsed time : 25680 us
Elapsed time : 25729 us
Elapsed time : 25835 us
Elapsed time : 25719 us
Elapsed time : 25830 us
Elapsed time : 25480 us
Elapsed time : 25508 us
Elapsed time : 25767 us
Elapsed time : 25545 us
Elapsed time : 25871 us
Elapsed time : 25903 us
Elapsed time : 25554 us
Elapsed time : 25938 us
Elapsed time : 25761 us
Elapsed time : 25636 us
Elapsed time : 25883 us
Elapsed time : 25727 us
Elapsed time : 25843 us
Elapsed time : 25734 us
Elapsed time : 25710 us
Elapsed time : 26114 us
Elapsed time : 26263 us
Elapsed time : 25661 us
Elapsed time : 25880 us
Elapsed time : 25801 us
Elapsed time : 25672 us
Elapsed time : 25744 us
Elapsed time : 25470 us
Elapsed time : 25836 us
Elapsed time : 25706 us
Elapsed time : 25626 us
Elapsed time : 25715 us
Elapsed time : 25648 us
Elapsed time : 25920 us
Elapsed time : 25790 us
Elapsed time : 25722 us
Elapsed time : 27063 us
Elapsed time : 25843 us
Elapsed time : 25612 us
Elapsed time : 26902 us
Elapsed time : 25618 us
Elapsed time : 25650 us
Elapsed time : 25812 us
Elapsed time : 25712 us
Elapsed time : 25846 us
Elapsed time : 25689 us
Elapsed time : 25820 us
Elapsed time : 25859 us
Elapsed time : 25757 us
Elapsed time : 25898 us
Elapsed time : 25827 us
Elapsed time : 25688 us
Elapsed time : 25930 us
Elapsed time : 25722 us
Elapsed time : 25880 us
Elapsed time : 25684 us
Elapsed time : 25542 us
Elapsed time : 25955 us
Elapsed time : 25766 us
Elapsed time : 25658 us
Elapsed time : 25576 us
Elapsed time : 25476 us
Elapsed time : 25698 us
Elapsed time : 25472 us
Elapsed time : 25675 us
Elapsed time : 25913 us
Elapsed time : 16389 us
Elapsed time : 11228 us
Elapsed time : 11177 us
Elapsed time : 11198 us
Elapsed time : 20570 us
Elapsed time : 25823 us
Elapsed time : 25814 us
Elapsed time : 25633 us
Elapsed time : 25846 us
Elapsed time : 25743 us
Elapsed time : 25556 us
Elapsed time : 25751 us
Elapsed time : 25812 us
Elapsed time : 25723 us
Elapsed time : 25614 us
Elapsed time : 25605 us
Elapsed time : 25752 us
Elapsed time : 25779 us
Elapsed time : 25569 us
Elapsed time : 25757 us
Elapsed time : 25718 us
Elapsed time : 25651 us
Elapsed time : 25732 us
Elapsed time : 25763 us
Elapsed time : 25721 us
Elapsed time : 25702 us
Elapsed time : 25639 us
Elapsed time : 25694 us
Elapsed time : 25435 us
Elapsed time : 25610 us
Elapsed time : 25689 us
Elapsed time : 25571 us
Elapsed time : 25638 us
Elapsed time : 25579 us
Elapsed time : 25565 us
Elapsed time : 25903 us
Elapsed time : 25582 us
Elapsed time : 25480 us
Elapsed time : 26024 us
Elapsed time : 26125 us
Elapsed time : 26022 us
Elapsed time : 26725 us
Elapsed time : 25650 us
Elapsed time : 27218 us
Elapsed time : 25735 us
Elapsed time : 26166 us
Elapsed time : 25857 us
Elapsed time : 25729 us
Elapsed time : 25741 us
Elapsed time : 25762 us
Elapsed time : 25567 us
Elapsed time : 25627 us
Elapsed time : 25786 us
Elapsed time : 25839 us
Elapsed time : 25871 us
Elapsed time : 25630 us
Elapsed time : 25764 us
Elapsed time : 25678 us
Elapsed time : 25715 us
Elapsed time : 25829 us
Elapsed time : 25688 us
Elapsed time : 25584 us
Elapsed time : 25651 us
Elapsed time : 26043 us
Elapsed time : 25936 us
Elapsed time : 25666 us
Elapsed time : 25654 us
Elapsed time : 25843 us
Elapsed time : 25650 us
Elapsed time : 25353 us
Elapsed time : 26047 us
Elapsed time : 25551 us
Elapsed time : 25594 us
Elapsed time : 25535 us
Elapsed time : 25541 us
Elapsed time : 25760 us
Elapsed time : 25484 us
Elapsed time : 25746 us
Elapsed time : 25900 us
Elapsed time : 25682 us
Elapsed time : 25864 us
Elapsed time : 25825 us
Elapsed time : 25548 us
Elapsed time : 25725 us
Elapsed time : 25708 us
Elapsed time : 25692 us
Elapsed time : 25699 us
Elapsed time : 25726 us
Elapsed time : 25855 us
Elapsed time : 25491 us
Elapsed time : 25983 us
Elapsed time : 25830 us
Elapsed time : 25575 us
Elapsed time : 25787 us
Elapsed time : 25804 us
Elapsed time : 25591 us
Elapsed time : 25795 us
Elapsed time : 26329 us
Elapsed time : 25625 us
Elapsed time : 25701 us
Elapsed time : 25320 us
Elapsed time : 25716 us
Elapsed time : 25691 us
Elapsed time : 25729 us
Elapsed time : 25744 us
Elapsed time : 25505 us
Elapsed time : 25846 us
Elapsed time : 25947 us
Elapsed time : 25740 us
Elapsed time : 25898 us
Elapsed time : 25597 us
Elapsed time : 25695 us
Elapsed time : 15582 us
Elapsed time : 11159 us
Elapsed time : 11614 us
Elapsed time : 11143 us
Elapsed time : 21905 us
Elapsed time : 25930 us
Elapsed time : 25720 us
Elapsed time : 25586 us
Elapsed time : 25727 us
Elapsed time : 25640 us
Elapsed time : 25696 us
Elapsed time : 25616 us
Elapsed time : 25723 us
Elapsed time : 25633 us
Elapsed time : 25725 us
Elapsed time : 25846 us
Elapsed time : 26152 us
Elapsed time : 25453 us
Elapsed time : 25752 us
Elapsed time : 25589 us
Elapsed time : 25560 us
Elapsed time : 25536 us
Elapsed time : 25692 us
Elapsed time : 25864 us
Elapsed time : 26899 us
Elapsed time : 25653 us
Elapsed time : 25755 us
Elapsed time : 25538 us
Elapsed time : 25655 us
Elapsed time : 25625 us
Elapsed time : 25837 us
Elapsed time : 25560 us
Elapsed time : 25443 us
Elapsed time : 25731 us
Elapsed time : 25674 us
Elapsed time : 25601 us
Elapsed time : 25533 us
Elapsed time : 25705 us
Elapsed time : 25559 us
Elapsed time : 25888 us
Elapsed time : 25564 us
Elapsed time : 25738 us
Elapsed time : 25842 us
Elapsed time : 25579 us
Elapsed time : 25724 us
Elapsed time : 25472 us
Elapsed time : 25568 us
Elapsed time : 25834 us
Elapsed time : 25529 us
Elapsed time : 25422 us
Elapsed time : 25877 us
Elapsed time : 25562 us
Elapsed time : 25672 us
Elapsed time : 25672 us
Elapsed time : 25691 us
Elapsed time : 25676 us
Elapsed time : 25733 us
Elapsed time : 25585 us
Elapsed time : 25718 us
Elapsed time : 25758 us
Elapsed time : 25998 us
Elapsed time : 25747 us
Elapsed time : 25559 us
Elapsed time : 23466 us
Elapsed time : 11170 us
Elapsed time : 11147 us
Elapsed time : 11262 us
Elapsed time : 11428 us
Elapsed time : 25704 us
Elapsed time : 25580 us
Elapsed time : 25946 us
Elapsed time : 25651 us
Elapsed time : 25677 us
Elapsed time : 25706 us
Elapsed time : 25777 us
Elapsed time : 25758 us
Elapsed time : 26005 us
Elapsed time : 25656 us
Elapsed time : 25554 us
Elapsed time : 25686 us
Elapsed time : 25644 us
Elapsed time : 25799 us
Elapsed time : 25359 us
Elapsed time : 25827 us
Elapsed time : 25752 us
Elapsed time : 25767 us
Elapsed time : 26226 us
Elapsed time : 25779 us
Elapsed time : 25817 us
Elapsed time : 25775 us
Elapsed time : 25757 us
Elapsed time : 25740 us
Elapsed time : 25651 us
Elapsed time : 25541 us
Elapsed time : 25714 us
Elapsed time : 26116 us
Elapsed time : 26160 us
Elapsed time : 25964 us
Elapsed time : 25706 us
Elapsed time : 25896 us
Elapsed time : 25864 us
Elapsed time : 26010 us
Elapsed time : 25883 us
Elapsed time : 25805 us
Elapsed time : 25572 us
Elapsed time : 26054 us
Elapsed time : 25409 us
Elapsed time : 25745 us
Elapsed time : 25791 us
Elapsed time : 25519 us
Elapsed time : 25890 us
Elapsed time : 25715 us
Elapsed time : 25542 us
Elapsed time : 25556 us
Elapsed time : 25808 us
Elapsed time : 25980 us
Elapsed time : 25643 us
Elapsed time : 25808 us
Elapsed time : 25647 us
Elapsed time : 26422 us
Elapsed time : 25808 us
Elapsed time : 25919 us
Elapsed time : 26177 us
Elapsed time : 25755 us
Elapsed time : 25972 us
Elapsed time : 25827 us
Elapsed time : 26409 us
Elapsed time : 25687 us
Elapsed time : 25861 us
Elapsed time : 25925 us
Elapsed time : 25599 us
Elapsed time : 25596 us
Elapsed time : 25761 us
Elapsed time : 25455 us
Elapsed time : 25885 us
Elapsed time : 25997 us
Elapsed time : 25626 us
Elapsed time : 25687 us
Elapsed time : 25880 us
Elapsed time : 25849 us
Elapsed time : 25714 us
Elapsed time : 25635 us
Elapsed time : 25928 us
Elapsed time : 25575 us
Elapsed time : 25779 us
Elapsed time : 25559 us
Elapsed time : 25601 us
Elapsed time : 25691 us
Elapsed time : 25379 us
Elapsed time : 25597 us
Elapsed time : 25563 us
Elapsed time : 25553 us
Elapsed time : 25678 us
Elapsed time : 25619 us
Elapsed time : 25725 us
Elapsed time : 25854 us
Elapsed time : 25612 us
Elapsed time : 25690 us
Elapsed time : 25800 us
Elapsed time : 25642 us
Elapsed time : 25659 us
Elapsed time : 25632 us
Elapsed time : 25819 us
Elapsed time : 25609 us
Elapsed time : 25749 us
Elapsed time : 25730 us
Elapsed time : 25797 us
Elapsed time : 25579 us
Elapsed time : 25987 us
Elapsed time : 25889 us
Elapsed time : 25436 us
Elapsed time : 25924 us
Elapsed time : 26191 us
Elapsed time : 25780 us
Elapsed time : 25865 us
Elapsed time : 25657 us
Elapsed time : 25927 us
Elapsed time : 25827 us
Elapsed time : 25577 us
Elapsed time : 25828 us
Elapsed time : 25577 us
Elapsed time : 25709 us
Elapsed time : 25812 us
Elapsed time : 25637 us
Elapsed time : 25624 us
Elapsed time : 25641 us
Elapsed time : 25800 us
Elapsed time : 26869 us
Elapsed time : 25459 us
Elapsed time : 25588 us
Elapsed time : 25740 us
Elapsed time : 26035 us
Elapsed time : 25729 us
Elapsed time : 25924 us
Elapsed time : 25521 us
Elapsed time : 25972 us
Elapsed time : 25614 us
Elapsed time : 25775 us
Elapsed time : 25747 us
Elapsed time : 25493 us
Elapsed time : 27051 us
Elapsed time : 25684 us
Elapsed time : 25369 us
Elapsed time : 25647 us
Elapsed time : 25561 us
Elapsed time : 25771 us
Elapsed time : 25684 us
Elapsed time : 26188 us
Elapsed time : 25702 us
Elapsed time : 25613 us
Elapsed time : 26225 us
Elapsed time : 25536 us
Elapsed time : 25504 us
Elapsed time : 25820 us
Elapsed time : 25800 us
Elapsed time : 25846 us
Elapsed time : 25728 us
Elapsed time : 25445 us
Elapsed time : 25940 us
Elapsed time : 25851 us
Elapsed time : 25510 us
Elapsed time : 25674 us
Elapsed time : 25630 us
Elapsed time : 25461 us
Elapsed time : 26059 us
Elapsed time : 25526 us
Elapsed time : 25645 us
Elapsed time : 26783 us
Elapsed time : 25942 us
Elapsed time : 25872 us
Elapsed time : 25874 us
Elapsed time : 25583 us
Elapsed time : 25715 us
Elapsed time : 25659 us
Elapsed time : 25757 us
Elapsed time : 25821 us
Elapsed time : 25742 us
Elapsed time : 25912 us
Elapsed time : 25570 us
Elapsed time : 25806 us
Elapsed time : 25828 us
Elapsed time : 25537 us
Elapsed time : 25716 us
Elapsed time : 25714 us
Elapsed time : 25606 us
Elapsed time : 25499 us
Elapsed time : 11154 us
Elapsed time : 11101 us
Elapsed time : 11365 us
Elapsed time : 11239 us
Elapsed time : 25912 us
Elapsed time : 25868 us
Elapsed time : 25624 us
Elapsed time : 25667 us
Elapsed time : 25682 us
Elapsed time : 25773 us
Elapsed time : 25520 us
Elapsed time : 25761 us
Elapsed time : 25680 us
Elapsed time : 25832 us
Elapsed time : 25785 us
Elapsed time : 25597 us
Elapsed time : 25516 us
Elapsed time : 25741 us
Elapsed time : 25645 us
Elapsed time : 25673 us
Elapsed time : 25779 us
Elapsed time : 25467 us
Elapsed time : 25836 us
Elapsed time : 25610 us
Elapsed time : 25793 us
Elapsed time : 26169 us
Elapsed time : 25684 us
Elapsed time : 25629 us
Elapsed time : 25938 us
Elapsed time : 25957 us
Elapsed time : 25850 us
Elapsed time : 25628 us
Elapsed time : 25699 us
Elapsed time : 25810 us
Elapsed time : 25781 us
Elapsed time : 25786 us
Elapsed time : 25728 us
Elapsed time : 25781 us
Elapsed time : 25814 us
Elapsed time : 25630 us
Elapsed time : 25801 us
Elapsed time : 25712 us
Elapsed time : 25505 us
Elapsed time : 25780 us
Elapsed time : 25724 us
Elapsed time : 25873 us
Elapsed time : 25722 us
Elapsed time : 26016 us
Elapsed time : 25671 us
Elapsed time : 25563 us
Elapsed time : 25742 us
Elapsed time : 25866 us
Elapsed time : 25569 us
Elapsed time : 25721 us
Elapsed time : 26035 us
Elapsed time : 25511 us
Elapsed time : 25887 us
Elapsed time : 25705 us
Elapsed time : 25809 us
Elapsed time : 25752 us
Elapsed time : 25670 us
Elapsed time : 25513 us
Elapsed time : 25545 us
Elapsed time : 25598 us
Elapsed time : 25646 us
Elapsed time : 11247 us
Elapsed time : 11249 us
Elapsed time : 11196 us
Elapsed time : 11175 us
Elapsed time : 25823 us
Elapsed time : 25786 us
Elapsed time : 25628 us
Elapsed time : 25654 us
Elapsed time : 25630 us
Elapsed time : 25682 us
Elapsed time : 25607 us
Elapsed time : 25927 us
Elapsed time : 25746 us
Elapsed time : 25824 us
Elapsed time : 25822 us
Elapsed time : 25669 us
Elapsed time : 25665 us
