CIC_MEM_VERS = 1.0
CREATION_DATE = 2024-01-16T10:17:15.206826
ORIGINATOR = CS Group

META_START
OBJECT_NAME = w2_op1_38
OBJECT_ID = w2_op1_38
USER_DEFINED_PROTOCOL = NONE
USER_DEFINED_CONTENT = COLOR
USER_DEFINED_SIZE = 3
USER_DEFINED_TYPE = REAL
USER_DEFINED_UNIT = [n/a]
TIME_SYSTEM = UTC
META_STOP

60325 36855.0 0.45098039215686275 0.8235294117647058 0.08627450980392157
