CIC_MEM_VERS = 1.0
CREATION_DATE = 2023-11-14T12:41:42.307599
ORIGINATOR = CS Group

META_START
OBJECT_NAME = SunSynchronous
OBJECT_ID = SunSynchronous
USER_DEFINED_PROTOCOL = NONE
USER_DEFINED_CONTENT = VISIBILITY
USER_DEFINED_SIZE = 1.0
USER_DEFINED_TYPE = STRING
USER_DEFINED_UNIT = [n/a]
TIME_SYSTEM = UTC
META_STOP

55197 58429.12033735548 START
55197 58895.889885961806 END
55197 64333.90947662221 START
55197 64556.116336728024 END
55198 20136.598849257858 START
55198 20621.43214196162 END
