\relax 
\providecommand\hyper@newdestlabel[2]{}
\providecommand\HyperFirstAtBeginDocument{\AtBeginDocument}
\HyperFirstAtBeginDocument{\ifx\hyper@anchor\@undefined
\global\let\oldcontentsline\contentsline
\gdef\contentsline#1#2#3#4{\oldcontentsline{#1}{#2}{#3}}
\global\let\oldnewlabel\newlabel
\gdef\newlabel#1#2{\newlabelxx{#1}#2}
\gdef\newlabelxx#1#2#3#4#5#6{\oldnewlabel{#1}{{#2}{#3}}}
\AtEndDocument{\ifx\hyper@anchor\@undefined
\let\contentsline\oldcontentsline
\let\newlabel\oldnewlabel
\fi}
\fi}
\global\let\hyper@last\relax 
\gdef\HyperFirstAtBeginDocument#1{#1}
\providecommand\HyField@AuxAddToFields[1]{}
\providecommand\HyField@AuxAddToCoFields[2]{}
\babel@aux{english}{}
\@writefile{lof}{\contentsline {xsect}{Preparation de l'espace de travail}{1}{section*.1}}
\@writefile{lot}{\contentsline {xsect}{Preparation de l'espace de travail}{1}{section*.1}}
\@writefile{toc}{\contentsline {section}{\numberline {1}Preparation de l'espace de travail}{1}{section.1}}
\@writefile{toc}{\contentsline {subsection}{\numberline {1.1}Introduction}{1}{subsection.1.1}}
\@writefile{lof}{\contentsline {figure}{\numberline {1}{\ignorespaces Fonctionnement classique d'un gestionnaire de version (centralis\IeC {\'e})$^2$  \relax \fontsize  {10.95}{13.6}\selectfont  \abovedisplayskip 11\p@ plus3\p@ minus6\p@ \abovedisplayshortskip \z@ plus3\p@ \belowdisplayshortskip 6.5\p@ plus3.5\p@ minus3\p@ \def \leftmargin \leftmargini \parsep 5\p@ plus2.5\p@ minus\p@ \topsep 10\p@ plus4\p@ minus6\p@ \itemsep 5\p@ plus2.5\p@ minus\p@ {\leftmargin \leftmargini \topsep 9\p@ plus3\p@ minus5\p@ \parsep 4.5\p@ plus2\p@ minus\p@ \itemsep \parsep }\belowdisplayskip \abovedisplayskip {$^2$\url  {https://blog.octo.com/introduction-a-la-gestion-de-version-distribuee/}} \relax }}{2}{figure.caption.2}}
\@writefile{toc}{\contentsline {subsection}{\numberline {1.2}Cr\IeC {\'e}ation d'un compte framagit}{2}{subsection.1.2}}
\@writefile{toc}{\contentsline {subsection}{\numberline {1.3}Constitution des bin\IeC {\^o}mes}{3}{subsection.1.3}}
\@writefile{toc}{\contentsline {subsection}{\numberline {1.4}R\IeC {\'e}cuperation du depot distant: git clone}{4}{subsection.1.4}}
\@writefile{toc}{\contentsline {subsection}{\numberline {1.5}R\IeC {\'e}cuperation du projet de page web "initialWebPage"}{4}{subsection.1.5}}
\@writefile{toc}{\contentsline {subsection}{\numberline {1.6}Premier commit}{5}{subsection.1.6}}
\@writefile{toc}{\contentsline {subsection}{\numberline {1.7}Pr\IeC {\^e}ts \IeC {\`a} travailler en \IeC {\'e}quipe !}{5}{subsection.1.7}}
\@writefile{lof}{\contentsline {xsect}{Premiers pas chacun de votre c\IeC {\^o}t\IeC {\'e} : Partie Alpha Team}{6}{subsection.1.7}}
\@writefile{lot}{\contentsline {xsect}{Premiers pas chacun de votre c\IeC {\^o}t\IeC {\'e} : Partie Alpha Team}{6}{subsection.1.7}}
\@writefile{toc}{\contentsline {section}{\numberline {2}Premiers pas chacun de votre c\IeC {\^o}t\IeC {\'e} : Partie Alpha Team}{6}{section.2}}
\@writefile{toc}{\contentsline {subsection}{\numberline {2.1}Pr\IeC {\'e}parez (r\IeC {\'e}cuperez) votre espace de travail}{6}{subsection.2.1}}
\@writefile{toc}{\contentsline {subsection}{\numberline {2.2}Exercice 1 - Afficher plus d'informations sur la page HTML -\\ Alpha Team}{6}{subsection.2.2}}
\@writefile{toc}{\contentsline {subsubsection}{\numberline {2.2.1}Travail individuel}{6}{subsubsection.2.2.1}}
\@writefile{toc}{\contentsline {subsubsection}{\numberline {2.2.2}Synchronisation avec votre bin\IeC {\^o}me}{7}{subsubsection.2.2.2}}
\@writefile{toc}{\contentsline {subsection}{\numberline {2.3}Exercice 2 - Premiers conflits potentiels}{7}{subsection.2.3}}
\@writefile{toc}{\contentsline {subsection}{\numberline {2.4}Exercice 3 : Travail d'\IeC {\'e}quipe - temporiser}{8}{subsection.2.4}}
\global\mtcsecondpartfalse
