Target: DefaultSat

Observer: DefaultGS
Start Time (UTC)            Stop Time (UTC)               Duration (s)         
01 Jan 2023 08:13:07.890    01 Jan 2023 08:18:53.196      345.30604547    
01 Jan 2023 09:47:12.188    01 Jan 2023 09:55:18.828      486.64017124    
01 Jan 2023 21:29:25.547    01 Jan 2023 21:36:21.031      415.48390078    
01 Jan 2023 23:04:47.027    01 Jan 2023 23:12:07.393      440.36569695    
02 Jan 2023 08:21:46.253    02 Jan 2023 08:28:16.846      390.59303108    
02 Jan 2023 09:56:30.030    02 Jan 2023 10:04:17.408      467.37820823    
02 Jan 2023 21:38:18.762    02 Jan 2023 21:45:46.030      447.26781169    
02 Jan 2023 23:14:04.585    02 Jan 2023 23:20:53.672      409.08647426    
03 Jan 2023 08:30:29.853    03 Jan 2023 08:37:36.069      426.21551942    
03 Jan 2023 10:05:51.878    03 Jan 2023 10:13:12.720      440.84227447    
03 Jan 2023 21:47:15.105    03 Jan 2023 21:55:05.902      470.79650686    
03 Jan 2023 23:23:25.284    03 Jan 2023 23:29:34.778      369.49425540    
04 Jan 2023 08:39:17.624    04 Jan 2023 08:46:51.912      454.28832939    
04 Jan 2023 10:15:18.547    04 Jan 2023 10:22:03.965      405.41841115    
04 Jan 2023 21:56:13.900    04 Jan 2023 22:04:21.345      487.44509955    
04 Jan 2023 23:32:50.527    04 Jan 2023 23:38:09.293      318.76643321    
05 Jan 2023 08:48:08.960    05 Jan 2023 08:56:04.961      476.00161278    
05 Jan 2023 10:24:51.470    05 Jan 2023 10:30:49.727      358.25657275    
05 Jan 2023 22:05:14.723    05 Jan 2023 22:13:32.793      498.07000137    
05 Jan 2023 23:42:23.470    05 Jan 2023 23:46:34.043      250.57265454    


Number of events : 20


