Spacecraft: DefaultSat

Start Time (UTC)            Stop Time (UTC)               Duration (s)    Occ Body        Type        Event Number  Total Duration (s)
01 Jan 2023 00:35:50.774    01 Jan 2023 00:36:03.798      13.024155493    Earth           Penumbra    1             1961.1167793
01 Jan 2023 00:36:03.798    01 Jan 2023 01:08:18.978      1935.1795756    Earth           Umbra       1             1961.1167793
01 Jan 2023 01:08:18.978    01 Jan 2023 01:08:31.891      12.913048232    Earth           Penumbra    1             1961.1167793
01 Jan 2023 02:42:57.954    01 Jan 2023 02:43:10.980      13.026118744    Earth           Penumbra    2             1960.9323814
01 Jan 2023 02:43:10.980    01 Jan 2023 03:15:25.971      1934.9912833    Earth           Umbra       2             1960.9323814
01 Jan 2023 03:15:25.971    01 Jan 2023 03:15:38.886      12.914979423    Earth           Penumbra    2             1960.9323814
01 Jan 2023 04:50:05.221    01 Jan 2023 04:50:18.250      13.028107455    Earth           Penumbra    3             1960.7596725
01 Jan 2023 04:50:18.250    01 Jan 2023 05:22:33.064      1934.8147774    Earth           Umbra       3             1960.7596725
01 Jan 2023 05:22:33.064    01 Jan 2023 05:22:45.981      12.916787714    Earth           Penumbra    3             1960.7596725
01 Jan 2023 06:57:12.409    01 Jan 2023 06:57:25.439      13.029566535    Earth           Penumbra    4             1960.5800608
01 Jan 2023 06:57:25.439    01 Jan 2023 07:29:40.071      1934.6322720    Earth           Umbra       4             1960.5800608
01 Jan 2023 07:29:40.071    01 Jan 2023 07:29:52.990      12.918222276    Earth           Penumbra    4             1960.5800608
01 Jan 2023 09:04:19.513    01 Jan 2023 09:04:32.544      13.030983496    Earth           Penumbra    5             1960.3995165
01 Jan 2023 09:04:32.544    01 Jan 2023 09:36:46.993      1934.4488567    Earth           Umbra       5             1960.3995165
01 Jan 2023 09:36:46.993    01 Jan 2023 09:36:59.913      12.919676327    Earth           Penumbra    5             1960.3995165
01 Jan 2023 11:11:26.588    01 Jan 2023 11:11:39.621      13.032758154    Earth           Penumbra    6             1960.2152421
01 Jan 2023 11:11:39.621    01 Jan 2023 11:43:53.882      1934.2609708    Earth           Umbra       6             1960.2152421
01 Jan 2023 11:43:53.882    01 Jan 2023 11:44:06.803      12.921513221    Earth           Penumbra    6             1960.2152421
01 Jan 2023 13:18:33.730    01 Jan 2023 13:18:46.765      13.035070617    Earth           Penumbra    7             1960.0478173
01 Jan 2023 13:18:46.765    01 Jan 2023 13:51:00.854      1934.0889839    Earth           Umbra       7             1960.0478173
01 Jan 2023 13:51:00.854    01 Jan 2023 13:51:13.778      12.923762819    Earth           Penumbra    7             1960.0478173
01 Jan 2023 15:25:40.880    01 Jan 2023 15:25:53.917      13.037098618    Earth           Penumbra    8             1959.8850865
01 Jan 2023 15:25:53.917    01 Jan 2023 15:58:07.839      1933.9222106    Earth           Umbra       8             1959.8850865
01 Jan 2023 15:58:07.839    01 Jan 2023 15:58:20.765      12.925777305    Earth           Penumbra    8             1959.8850865
01 Jan 2023 17:32:48.072    01 Jan 2023 17:33:01.111      13.039051183    Earth           Penumbra    9             1959.7115384
01 Jan 2023 17:33:01.111    01 Jan 2023 18:05:14.855      1933.7446291    Earth           Umbra       9             1959.7115384
01 Jan 2023 18:05:14.855    01 Jan 2023 18:05:27.783      12.927858112    Earth           Penumbra    9             1959.7115384
01 Jan 2023 19:39:55.242    01 Jan 2023 19:40:08.283      13.040915737    Earth           Penumbra    10            1959.5434324
01 Jan 2023 19:40:08.283    01 Jan 2023 20:12:21.855      1933.5727676    Earth           Umbra       10            1959.5434324
01 Jan 2023 20:12:21.855    01 Jan 2023 20:12:34.785      12.929749070    Earth           Penumbra    10            1959.5434324
01 Jan 2023 21:47:02.379    01 Jan 2023 21:47:15.422      13.042835612    Earth           Penumbra    11            1959.3708410
01 Jan 2023 21:47:15.422    01 Jan 2023 22:19:28.818      1933.3964515    Earth           Umbra       11            1959.3708410
01 Jan 2023 22:19:28.818    01 Jan 2023 22:19:41.750      12.931553903    Earth           Penumbra    11            1959.3708410
01 Jan 2023 23:54:09.487    01 Jan 2023 23:54:22.531      13.044602098    Earth           Penumbra    12            1959.1866349
01 Jan 2023 23:54:22.531    02 Jan 2023 00:26:35.740      1933.2088281    Earth           Umbra       12            1959.1866349
02 Jan 2023 00:26:35.740    02 Jan 2023 00:26:48.673      12.933204719    Earth           Penumbra    12            1959.1866349
02 Jan 2023 02:01:16.648    02 Jan 2023 02:01:29.695      13.046506257    Earth           Penumbra    13            1958.9925559
02 Jan 2023 02:01:29.695    02 Jan 2023 02:33:42.706      1933.0109948    Earth           Umbra       13            1958.9925559
02 Jan 2023 02:33:42.706    02 Jan 2023 02:33:55.641      12.935054814    Earth           Penumbra    13            1958.9925559
02 Jan 2023 04:08:23.917    02 Jan 2023 04:08:36.966      13.048627926    Earth           Penumbra    14            1958.8125321
02 Jan 2023 04:08:36.966    02 Jan 2023 04:40:49.793      1932.8268497    Earth           Umbra       14            1958.8125321
02 Jan 2023 04:40:49.793    02 Jan 2023 04:41:02.730      12.937054527    Earth           Penumbra    14            1958.8125321
02 Jan 2023 06:15:31.159    02 Jan 2023 06:15:44.209      13.050275913    Earth           Penumbra    15            1958.6325640
02 Jan 2023 06:15:44.209    02 Jan 2023 06:47:56.853      1932.6436921    Earth           Umbra       15            1958.6325640
02 Jan 2023 06:47:56.853    02 Jan 2023 06:48:09.791      12.938595959    Earth           Penumbra    15            1958.6325640
02 Jan 2023 08:22:38.305    02 Jan 2023 08:22:51.357      13.051705761    Earth           Penumbra    16            1958.4459240
02 Jan 2023 08:22:51.357    02 Jan 2023 08:55:03.811      1932.4541443    Earth           Umbra       16            1958.4459240
02 Jan 2023 08:55:03.811    02 Jan 2023 08:55:16.751      12.940073898    Earth           Penumbra    16            1958.4459240
02 Jan 2023 10:29:45.394    02 Jan 2023 10:29:58.447      13.053364120    Earth           Penumbra    17            1958.2582239
02 Jan 2023 10:29:58.447    02 Jan 2023 11:02:10.710      1932.2630769    Earth           Umbra       17            1958.2582239
02 Jan 2023 11:02:10.710    02 Jan 2023 11:02:23.652      12.941782863    Earth           Penumbra    17            1958.2582239
02 Jan 2023 12:36:52.526    02 Jan 2023 12:37:05.581      13.055570028    Earth           Penumbra    18            1958.0757943
02 Jan 2023 12:37:05.581    02 Jan 2023 13:09:17.658      1932.0762138    Earth           Umbra       18            1958.0757943
02 Jan 2023 13:09:17.658    02 Jan 2023 13:09:30.602      12.944010459    Earth           Penumbra    18            1958.0757943
02 Jan 2023 14:43:59.700    02 Jan 2023 14:44:12.758      13.057789765    Earth           Penumbra    19            1957.9132555
02 Jan 2023 14:44:12.758    02 Jan 2023 15:16:24.667      1931.9093261    Earth           Umbra       19            1957.9132555
02 Jan 2023 15:16:24.667    02 Jan 2023 15:16:37.613      12.946139672    Earth           Penumbra    19            1957.9132555
02 Jan 2023 16:51:06.895    02 Jan 2023 16:51:19.955      13.059817767    Earth           Penumbra    20            1957.7345641
02 Jan 2023 16:51:19.955    02 Jan 2023 17:23:31.681      1931.7264910    Earth           Umbra       20            1957.7345641
02 Jan 2023 17:23:31.681    02 Jan 2023 17:23:44.629      12.948255369    Earth           Penumbra    20            1957.7345641
02 Jan 2023 18:58:14.096    02 Jan 2023 18:58:27.158      13.061754929    Earth           Penumbra    21            1957.5620102
02 Jan 2023 18:58:27.158    02 Jan 2023 19:30:38.708      1931.5499681    Earth           Umbra       21            1957.5620102
02 Jan 2023 19:30:38.708    02 Jan 2023 19:30:51.658      12.950287142    Earth           Penumbra    21            1957.5620102
02 Jan 2023 21:05:21.258    02 Jan 2023 21:05:34.322      13.063698064    Earth           Penumbra    22            1957.3853999
02 Jan 2023 21:05:34.322    02 Jan 2023 21:37:45.691      1931.3695502    Earth           Umbra       22            1957.3853999
02 Jan 2023 21:37:45.691    02 Jan 2023 21:37:58.644      12.952151697    Earth           Penumbra    22            1957.3853999
02 Jan 2023 23:12:28.390    02 Jan 2023 23:12:41.455      13.065566705    Earth           Penumbra    23            1957.2024162
02 Jan 2023 23:12:41.455    02 Jan 2023 23:44:52.638      1931.1829476    Earth           Umbra       23            1957.2024162
02 Jan 2023 23:44:52.638    02 Jan 2023 23:45:05.592      12.953901838    Earth           Penumbra    23            1957.2024162
03 Jan 2023 01:19:35.539    03 Jan 2023 01:19:48.606      13.067419943    Earth           Penumbra    24            1957.0024679
03 Jan 2023 01:19:48.606    03 Jan 2023 01:51:59.586      1930.9793799    Earth           Umbra       24            1957.0024679
03 Jan 2023 01:51:59.586    03 Jan 2023 01:52:12.541      12.955668010    Earth           Penumbra    24            1957.0024679
03 Jan 2023 03:26:42.793    03 Jan 2023 03:26:55.862      13.069568016    Earth           Penumbra    25            1956.8135972
03 Jan 2023 03:26:55.862    03 Jan 2023 03:59:06.648      1930.7862668    Earth           Umbra       25            1956.8135972
03 Jan 2023 03:59:06.648    03 Jan 2023 03:59:19.606      12.957762333    Earth           Penumbra    25            1956.8135972
03 Jan 2023 05:33:50.083    03 Jan 2023 05:34:03.155      13.071459602    Earth           Penumbra    26            1956.6314476
03 Jan 2023 05:34:03.155    03 Jan 2023 06:06:13.755      1930.6005045    Earth           Umbra       26            1956.6314476
03 Jan 2023 06:06:13.755    03 Jan 2023 06:06:26.715      12.959483557    Earth           Penumbra    26            1956.6314476
03 Jan 2023 07:40:57.273    03 Jan 2023 07:41:10.346      13.072939112    Earth           Penumbra    27            1956.4394834
03 Jan 2023 07:41:10.346    03 Jan 2023 08:13:20.752      1930.4055451    Earth           Umbra       27            1956.4394834
03 Jan 2023 08:13:20.752    03 Jan 2023 08:13:33.713      12.960999215    Earth           Penumbra    27            1956.4394834
03 Jan 2023 09:48:04.389    03 Jan 2023 09:48:17.464      13.074519206    Earth           Penumbra    28            1956.2489038
03 Jan 2023 09:48:17.464    03 Jan 2023 10:20:27.675      1930.2117656    Earth           Umbra       28            1956.2489038
03 Jan 2023 10:20:27.675    03 Jan 2023 10:20:40.638      12.962618913    Earth           Penumbra    28            1956.2489038
03 Jan 2023 11:55:11.514    03 Jan 2023 11:55:24.591      13.076576754    Earth           Penumbra    29            1956.0557583
03 Jan 2023 11:55:24.591    03 Jan 2023 12:27:34.605      1930.0144400    Earth           Umbra       29            1956.0557583
03 Jan 2023 12:27:34.605    03 Jan 2023 12:27:47.570      12.964741525    Earth           Penumbra    29            1956.0557583
03 Jan 2023 14:02:18.708    03 Jan 2023 14:02:31.787      13.078990427    Earth           Penumbra    30            1955.8871082
03 Jan 2023 14:02:31.787    03 Jan 2023 14:34:41.628      1929.8410808    Earth           Umbra       30            1955.8871082
03 Jan 2023 14:34:41.628    03 Jan 2023 14:34:54.595      12.967037014    Earth           Penumbra    30            1955.8871082
03 Jan 2023 16:09:25.901    03 Jan 2023 16:09:38.982      13.081068406    Earth           Penumbra    31            1955.7076031
03 Jan 2023 16:09:38.982    03 Jan 2023 16:41:48.639      1929.6573722    Earth           Umbra       31            1955.7076031
03 Jan 2023 16:41:48.639    03 Jan 2023 16:42:01.608      12.969162455    Earth           Penumbra    31            1955.7076031
03 Jan 2023 18:16:33.128    03 Jan 2023 18:16:46.211      13.083078177    Earth           Penumbra    32            1955.5276054
03 Jan 2023 18:16:46.211    03 Jan 2023 18:48:55.684      1929.4732123    Earth           Umbra       32            1955.5276054
03 Jan 2023 18:48:55.684    03 Jan 2023 18:49:08.655      12.971314928    Earth           Penumbra    32            1955.5276054
03 Jan 2023 20:23:40.317    03 Jan 2023 20:23:53.402      13.085032627    Earth           Penumbra    33            1955.3476790
03 Jan 2023 20:23:53.402    03 Jan 2023 20:56:02.692      1929.2894081    Earth           Umbra       33            1955.3476790
03 Jan 2023 20:56:02.692    03 Jan 2023 20:56:15.665      12.973238260    Earth           Penumbra    33            1955.3476790
03 Jan 2023 22:30:47.478    03 Jan 2023 22:31:00.565      13.087010337    Earth           Penumbra    34            1955.1636904
03 Jan 2023 22:31:00.565    03 Jan 2023 23:03:09.667      1929.1015854    Earth           Umbra       34            1955.1636904
03 Jan 2023 23:03:09.667    03 Jan 2023 23:03:22.642      12.975094642    Earth           Penumbra    34            1955.1636904

Number of individual events : 102
Number of total events      : 34
Maximum duration (s)        :   1961.1167793
Maximum duration at the 1st eclipse.


