\relax 
\providecommand\hyper@newdestlabel[2]{}
\providecommand\HyperFirstAtBeginDocument{\AtBeginDocument}
\HyperFirstAtBeginDocument{\ifx\hyper@anchor\@undefined
\global\let\oldcontentsline\contentsline
\gdef\contentsline#1#2#3#4{\oldcontentsline{#1}{#2}{#3}}
\global\let\oldnewlabel\newlabel
\gdef\newlabel#1#2{\newlabelxx{#1}#2}
\gdef\newlabelxx#1#2#3#4#5#6{\oldnewlabel{#1}{{#2}{#3}}}
\AtEndDocument{\ifx\hyper@anchor\@undefined
\let\contentsline\oldcontentsline
\let\newlabel\oldnewlabel
\fi}
\fi}
\global\let\hyper@last\relax 
\gdef\HyperFirstAtBeginDocument#1{#1}
\providecommand\HyField@AuxAddToFields[1]{}
\providecommand\HyField@AuxAddToCoFields[2]{}
\citation{lyons_transparency_2014}
\citation{doi:10.1080/14639220500337708}
\citation{hinss_open_2021}
\@writefile{toc}{\contentsline {section}{\numberline {I}Context}{1}{section.1}\protected@file@percent }
\newlabel{sec:problem-statement}{{I}{1}{Context}{section.1}{}}
\@writefile{toc}{\contentsline {section}{\numberline {II}Problem statement}{1}{section.2}\protected@file@percent }
\newlabel{sec:problem-statement}{{II}{1}{Problem statement}{section.2}{}}
\citation{SOMON2019266}
\citation{elkins_comparison_nodate}
\citation{akash_classification_2018}
\citation{blais_alpha_2019}
\citation{akash_classification_2018}
\@writefile{toc}{\contentsline {section}{\numberline {III}Literature Review}{2}{section.3}\protected@file@percent }
\citation{SU2018359}
\citation{fu_trust_2019}
\@writefile{toc}{\contentsline {section}{\numberline {IV}Data and Methods}{3}{section.4}\protected@file@percent }
\@writefile{lof}{\contentsline {figure}{\numberline {1}{\ignorespaces Modified Berg experiment used for the data-set}}{3}{figure.1}\protected@file@percent }
\newlabel{fig:my_label}{{1}{3}{Modified Berg experiment used for the data-set}{figure.1}{}}
\@writefile{toc}{\contentsline {subsection}{\numberline {\mbox  {IV-A}}Pre-processing}{3}{subsection.4.1}\protected@file@percent }
\citation{elkins_comparison_nodate}
\@writefile{toc}{\contentsline {subsection}{\numberline {\mbox  {IV-B}}Post-processing}{4}{subsection.4.2}\protected@file@percent }
\@writefile{toc}{\contentsline {subsubsection}{\numberline {\mbox  {IV-B}1}Time-domain Evoked objects}{4}{subsubsection.4.2.1}\protected@file@percent }
\@writefile{toc}{\contentsline {subsubsection}{\numberline {\mbox  {IV-B}2}Time-Frequency Evoked objects}{4}{subsubsection.4.2.2}\protected@file@percent }
\@writefile{toc}{\contentsline {section}{\numberline {V}First results and future work}{4}{section.5}\protected@file@percent }
\@writefile{toc}{\contentsline {subsection}{\numberline {\mbox  {V-A}}Open Source Data-sets}{4}{subsection.5.1}\protected@file@percent }
\@writefile{toc}{\contentsline {subsection}{\numberline {\mbox  {V-B}}Statistical Analysis}{4}{subsection.5.2}\protected@file@percent }
\@writefile{lof}{\contentsline {figure}{\numberline {2}{\ignorespaces Average amplitude between 250-350 ms after feedback event}}{4}{figure.2}\protected@file@percent }
\newlabel{fig:my_label}{{2}{4}{Average amplitude between 250-350 ms after feedback event}{figure.2}{}}
\@writefile{lot}{\contentsline {table}{\numberline {I}{\ignorespaces T-test on the average amplitude between 250-350ms or P300 for trust and betrayal condition}}{4}{table.1}\protected@file@percent }
\newlabel{tab:my-table}{{I}{4}{T-test on the average amplitude between 250-350ms or P300 for trust and betrayal condition}{table.1}{}}
\bibstyle{plain}
\bibdata{reftrusteeg}
\bibcite{ajenaghughrure_psychophysiological_2021}{1}
\bibcite{akash_classification_2018}{2}
\bibcite{blais_alpha_2019}{3}
\bibcite{choo_detecting_2022}{4}
\bibcite{de_visser_learning_2018}{5}
\bibcite{dong_preliminary_2015}{6}
\bibcite{elkins_comparison_nodate}{7}
\bibcite{fu_trust_2019}{8}
\bibcite{hancock_meta-analysis_2011}{9}
\bibcite{hinss_open_2021}{10}
\bibcite{hu_real-time_2016}{11}
\bibcite{lawhern_eegnet_2018}{12}
\@writefile{lof}{\contentsline {figure}{\numberline {3}{\ignorespaces Average amplitude between 80-150 ms after feedback event}}{5}{figure.3}\protected@file@percent }
\newlabel{fig:my_label}{{3}{5}{Average amplitude between 80-150 ms after feedback event}{figure.3}{}}
\@writefile{lot}{\contentsline {table}{\numberline {II}{\ignorespaces T-test on the average amplitude between 80-150ms or ERN for trust and betrayal condition}}{5}{table.2}\protected@file@percent }
\newlabel{tab:my-table}{{II}{5}{T-test on the average amplitude between 80-150ms or ERN for trust and betrayal condition}{table.2}{}}
\@writefile{toc}{\contentsline {subsection}{\numberline {\mbox  {V-C}}Feature Extraction}{5}{subsection.5.3}\protected@file@percent }
\@writefile{toc}{\contentsline {section}{\numberline {VI}Conclusion}{5}{section.6}\protected@file@percent }
\@writefile{toc}{\contentsline {section}{References}{5}{section*.2}\protected@file@percent }
\bibcite{lotte_review_2018}{13}
\bibcite{lyons_transparency_2014}{14}
\bibcite{doi:10.1080/14639220500337708}{15}
\bibcite{SU2018359}{16}
\bibcite{oh_neurological_2020}{17}
\bibcite{somon_correlats_nodate}{18}
\bibcite{SOMON2019266}{19}
\bibcite{wang_eeg-based_2018}{20}
\citation{*}
