\relax 
\providecommand\hyper@newdestlabel[2]{}
\@nameuse{bbl@beforestart}
\providecommand\HyperFirstAtBeginDocument{\AtBeginDocument}
\HyperFirstAtBeginDocument{\ifx\hyper@anchor\@undefined
\global\let\oldcontentsline\contentsline
\gdef\contentsline#1#2#3#4{\oldcontentsline{#1}{#2}{#3}}
\global\let\oldnewlabel\newlabel
\gdef\newlabel#1#2{\newlabelxx{#1}#2}
\gdef\newlabelxx#1#2#3#4#5#6{\oldnewlabel{#1}{{#2}{#3}}}
\AtEndDocument{\ifx\hyper@anchor\@undefined
\let\contentsline\oldcontentsline
\let\newlabel\oldnewlabel
\fi}
\fi}
\global\let\hyper@last\relax 
\gdef\HyperFirstAtBeginDocument#1{#1}
\providecommand\HyField@AuxAddToFields[1]{}
\providecommand\HyField@AuxAddToCoFields[2]{}
\citation{berberian2017out}
\citation{dekker2002maba}
\citation{wickens2021engineering}
\citation{parasuraman1997humans}
\citation{ajenaghughrure2020measuring}
\citation{elkins2021comparison}
\citation{de2018learning}
\citation{hancock2011meta}
\citation{lotte2018review}
\citation{lotte2018review}
\babel@aux{english}{}
\@writefile{toc}{\contentsline {section}{\numberline {1}Introduction}{1}{section.1}\protected@file@percent }
\citation{roy2022retrospective}
\@writefile{lof}{\contentsline {figure}{\numberline {1}{\ignorespaces Typical classification process in EEG-based BCI systems, from \cite  {lotte2018review}.}}{2}{figure.1}\protected@file@percent }
\newlabel{pipeline}{{1}{2}{Typical classification process in EEG-based BCI systems, from \cite {lotte2018review}}{figure.1}{}}
\@writefile{toc}{\contentsline {section}{\numberline {2}Project}{2}{section.2}\protected@file@percent }
\@writefile{toc}{\contentsline {subsection}{\numberline {2.1}Why?}{2}{subsection.2.1}\protected@file@percent }
\citation{scikit-learn}
\citation{GramfortEtAl2013a}
\citation{jayaram2018moabb}
\citation{xu2021topological}
\citation{rommel2022data}
\citation{jayaram2018moabb}
\@writefile{toc}{\contentsline {subsection}{\numberline {2.2}How?}{3}{subsection.2.2}\protected@file@percent }
\@writefile{toc}{\contentsline {section}{\numberline {3}PhD candidate profile}{3}{section.3}\protected@file@percent }
\bibstyle{plain}
\bibdata{bibfile}
\bibcite{ajenaghughrure2020measuring}{1}
\bibcite{berberian2017out}{2}
\bibcite{de2018learning}{3}
\bibcite{dekker2002maba}{4}
\bibcite{elkins2021comparison}{5}
\bibcite{GramfortEtAl2013a}{6}
\bibcite{hancock2011meta}{7}
\bibcite{jayaram2018moabb}{8}
\bibcite{lotte2018review}{9}
\bibcite{parasuraman1997humans}{10}
\bibcite{scikit-learn}{11}
\bibcite{rommel2022data}{12}
\bibcite{roy2022retrospective}{13}
\bibcite{wickens2021engineering}{14}
\bibcite{xu2021topological}{15}
\@writefile{toc}{\contentsline {section}{\numberline {4}Application procedure}{4}{section.4}\protected@file@percent }
