\begin{thebibliography}{1}

\bibitem{lotte2018review}
Fabien Lotte, Laurent Bougrain, Andrzej Cichocki, Maureen Clerc, Marco Congedo,
  Alain Rakotomamonjy, and Florian Yger.
\newblock A review of classification algorithms for eeg-based brain--computer
  interfaces: a 10 year update.
\newblock {\em Journal of neural engineering}, 15(3):031005, 2018.

\end{thebibliography}
