"IRIDIUM 7 [-]           
1 24793U 97020B   22151.83023050  .00000226  00000+0  73367-4 0  9994
2 24793  86.3944 282.4811 0002196  97.1210 263.0236 14.34497654312369
IRIDIUM 5 [-]           
1 24795U 97020D   22151.59012137  .00001905  00000+0  20285-3 0  9998
2 24795  86.4001 229.5888 0138639 122.3037 239.1702 14.81338114320203
IRIDIUM 4 [-]           
1 24796U 97020E   22151.82163796  .00000235  00000+0  75207-4 0  9993
2 24796  86.3943 280.0996 0001979  93.3570 266.7853 14.35402787312835
IRIDIUM 914 [-]         
1 24836U 97030A   22151.79671716  .00000257  00000+0  76645-4 0  9992
2 24836  86.3911 291.9194 0000520  48.9454 311.1789 14.39117506447067
IRIDIUM 16 [-]          
1 24841U 97030F   22151.73028195  .00000244  00000+0  75420-4 0  9995
2 24841  86.4006 311.9937 0004475 105.4869 254.6822 14.37071867307161
IRIDIUM 911 [-]         
1 24842U 97030G   22151.88109891  .00000316  00000+0  83925-4 0  9994
2 24842  86.4434 311.6174 0013883 191.4082 168.6808 14.45396802314313
IRIDIUM 17 [-]          
1 24870U 97034B   22151.85125984  .00000248  00000+0  78307-4 0  9999
2 24870  86.3951 341.7272 0003811  73.1759 286.9855 14.36128483303869
IRIDIUM 920 [-]         
1 24871U 97034C   22151.77252686  .00000241  00000+0  70432-4 0  9995
2 24871  86.3951 323.6084 0013014 139.0564 221.1615 14.39844654306431
IRIDIUM 921 [-]         
1 24873U 97034E   22151.79460342  .00004291  00000+0  22449-3 0  9992
2 24873  86.3895 288.7091 0008033 158.8388 201.3187 15.15541558361377
IRIDIUM 26 [-]          
1 24903U 97043A   22151.45613325  .00000234  00000+0  74559-4 0  9993
2 24903  86.4006 217.1613 0002326  97.5361 262.6100 14.35577216297038
IRIDIUM 22 [-]          
1 24907U 97043E   22151.43467501  .00000233  00000+0  75825-4 0  9994
2 24907  86.4007 219.8263 0002187  92.1984 267.9462 14.34507600297184
DUMMY MASS 1 [-]        
1 24925U 97048A   22151.66204494  .00000261  00000+0  27006-4 0  9993
2 24925  86.3328 288.9838 0009050 116.5054 243.7099 14.85377134339918
DUMMY MASS 2 [-]        
1 24926U 97048B   22151.64675230  .00000258  00000+0  26867-4 0  9992
2 24926  86.3327 290.4067 0009645 125.2524 234.9604 14.85143086339718
IRIDIUM 29 [-]          
1 24944U 97051A   22151.53388316  .00000237  00000+0  76282-4 0  9993
2 24944  86.3978 249.9375 0001966  91.1732 268.9689 14.34940061293868
IRIDIUM 33 [-]          
1 24946U 97051C   22151.55209198  .00000194  00000+0  62447-4 0  9997
2 24946  86.3893 249.3010 0010114 104.6080 255.6238 14.33830217293264
IRIDIUM 28 [-]          
1 24948U 97051E   22151.53512487  .00000233  00000+0  73781-4 0  9992
2 24948  86.3985 248.0926 0002541  98.5936 261.5549 14.35877662294119
IRIDIUM 36 [-]          
1 24967U 97056C   22151.80933377  .00000240  00000+0  75985-4 0  9999
2 24967  86.3955 279.6555 0002252  87.1549 272.9905 14.35957660292519
IRIDIUM 39 [-]          
1 25042U 97069D   22151.71747579  .00000377  00000+0  98626-4 0  9993
2 25042  86.3898 326.9931 0020730  58.0449 302.2766 14.46652649288014
IRIDIUM 38 [-]          
1 25043U 97069E   22151.91616109  .00000247  00000+0  77699-4 0  9993
2 25043  86.3949 340.3087 0003361 109.6150 250.5410 14.36388476286211
IRIDIUM 42 [-]          
1 25077U 97077A   22151.79678210  .00000228  00000+0  73691-4 0  9993
2 25077  86.3961 345.1926 0002524 100.3872 259.7608 14.34764364281628
IRIDIUM 44 [-]          
1 25078U 97077B   22151.77058161  .00000239  00000+0  71780-4 0  9998
2 25078  86.3937 330.1000 0004125  86.1689 273.9981 14.38498935283700
IRIDIUM 45 [-]          
1 25104U 97082A   22151.86966062  .00003375  00000+0  25000-3 0  9999
2 25104  86.3833 207.5506 0206442  39.6136 321.9965 14.87174587285323
IRIDIUM 24 [-]          
1 25105U 97082B   22151.86205940  .00000269  00000+0  78700-4 0  9996
2 25105  86.3948 190.9659 0013038 138.7764 221.4422 14.40229236283039
IRIDIUM 51 [-]          
1 25262U 98018A   22151.88449962  .00003108  00000+0  20649-3 0  9999
2 25262  86.4009 219.0849 0194539  11.2655 349.2831 14.92488621279407
IRIDIUM 57 [-]          
1 25273U 98019B   22151.54792753  .00000216  00000+0  69506-4 0  9997
2 25273  86.3981 250.8902 0002163  93.0281 267.1163 14.34539806265212
IRIDIUM 63 [-]          
1 25286U 98021B   22151.82900178  .00000208  00000+0  66258-4 0  9999
2 25286  86.4022 187.7923 0002057  89.9142 270.2290 14.34998437264254
IRIDIUM 69 [-]          
1 25319U 98026A   22151.88567522  .00000207  00000+0  60715-4 0  9990
2 25319  86.4031 204.2374 0004518  89.0112 271.1604 14.39058667263017
IRIDIUM 71 [-]          
1 25320U 98026B   22151.85737289  .00000241  00000+0  70882-4 0  9992
2 25320  86.4012 199.2936 0003802 120.6165 239.5409 14.39436522263505
IRIDIUM 73 [-]          
1 25344U 98032C   22151.73881018  .00000282  00000+0  68354-4 0  9998
2 25344  86.4426 158.0239 0002708  99.3733 260.7778 14.49444748269327
IRIDIUM 82 [-]          
1 25467U 98051A   22151.77675210  .00002986  00000+0  20723-3 0  9994
2 25467  86.3981 273.1953 0171980  49.3526 312.2510 14.93792687256425
IRIDIUM 2 [-]           
1 25527U 98066A   22151.42943171  .00005577  00000+0  23795-3 0  9994
2 25527  85.5301  40.9743 0005246 259.7565 100.3087 15.22670902292914
"
