"SAUDISAT 1C             
1 27607U 02058C   17170.30781684  .00000023  00000-0  23717-4 0  9999
2 27607  64.5553 119.0812 0029658  95.5271 264.9215 14.75332147779293
SAUDISAT 2              
1 28371U 04025F   17170.42976027 -.00000016  00000-0  67266-5 0  9995
2 28371  98.1344 124.9269 0025235 335.7576  24.2416 14.54252344688160
SAUDISAT 3              
1 31118U 07012B   17170.45764772 -.00000013  00000-0  56396-5 0  9991
2 31118  97.7310 163.8138 0013672 262.7938  97.1716 14.69057698545346
PISAT                   
1 41784U 16059B   17170.48769998  .00000106  00000-0  29749-4 0  9993
2 41784  98.1671 231.9971 0032787 151.0603 209.2426 14.63223153 38919
"
