"GOES 1 (SMS-C) [-]      
1 08366U 75100A   22178.31888951 -.00000205  00000+0  00000+0 0  9995
2 08366   8.2538 295.6231 0001792 209.3461 162.9128  1.00288322170523
GOES 2 [-]              
1 10061U 77048A   22178.55675531  .00000062  00000+0  00000+0 0  9997
2 10061   9.8278 306.9950 0010979  31.8377 168.5520  0.99397549 31850
GOES 3 [-]              
1 10953U 78062A   22178.45699890  .00000047  00000+0  00000+0 0  9990
2 10953  10.1545 311.4839 0003711 139.2189 240.4742  0.99358286114122
GOES 4 [-]              
1 11964U 80074A   22178.25450275 -.00000233  00000+0  00000+0 0  9997
2 11964  11.1128 315.3048 0033667  76.3294 290.7369  0.99231772113042
GOES 5 [-]              
1 12472U 81049A   22178.39048307 -.00000233  00000+0  00000+0 0  9999
2 12472  11.9408 326.6407 0002485 135.6807 231.0085  1.00326236108302
GOES 6 [-]              
1 14050U 83041A   22178.89305134 -.00000237  00000+0  00000+0 0  9990
2 14050  12.4931 331.9304 0005430 134.0268  49.8574  1.00306221201477
GOES 7 [-]              
1 17561U 87022A   22178.60418272  .00000059  00000+0  00000+0 0  9991
2 17561  14.2330 348.4706 0006797  70.7045 306.7718  0.99893401112479
GOES 8 [-]              
1 23051U 94022A   22177.96754831 -.00000228  00000+0  00000+0 0  9991
2 23051  13.1847  24.1299 0008248  42.2301 152.4689  0.98906357109774
GOES 9 [-]              
1 23581U 95025A   22178.73647597 -.00000027  00000+0  00000+0 0  9996
2 23581  12.6779  24.4436 0009070  88.3268 281.4624  0.98799993 98431
GOES 10 [-]             
1 24786U 97019A   22178.60209375  .00000002  00000+0  00000+0 0  9995
2 24786  11.4306  30.6046 0024998 198.3131 162.0644  0.99122081 91680
GOES 11 [-]             
1 26352U 00022A   22178.50321913 -.00000227  00000+0  00000+0 0  9996
2 26352   8.7044  59.2506 0002181  40.2783 119.4779  0.99043274 38104
GOES 12 [-]             
1 26871U 01031A   22178.77327519  .00000032  00000+0  00000+0 0  9993
2 26871   9.5354  48.1230 0007734 343.6158 200.0934  0.99136760 76384
EWS-G1 (GOES 13) [+]    
1 29155U 06018A   22178.84976909  .00000048  00000+0  00000+0 0  9999
2 29155   0.6271  96.9455 0003570  88.8740  97.2357  1.00270324 28831
GOES 14 [B]             
1 35491U 09033A   22178.60139601 -.00000082  00000+0  00000+0 0  9992
2 35491   0.3433  95.4130 0012637 116.5077 175.5757  1.00270714 47566
GOES 15 [B]             
1 36411U 10008A   22178.66846256  .00000065  00000+0  00000+0 0  9996
2 36411   0.3160 102.0593 0001926  14.7298 271.1210  1.00271199 45122
GOES 16 [+]             
1 41866U 16071A   22178.89435962 -.00000240  00000+0  00000+0 0  9991
2 41866   0.0608 237.2411 0000474 278.6857   6.8126  1.00272239 20561
GOES 17 [+]             
1 43226U 18022A   22178.09265142  .00000106  00000+0  00000+0 0  9994
2 43226   0.0819 252.4481 0000089 239.4954  39.3909  1.00272365 15876
GOES 18 [+]             
1 51850U 22021A   22178.73856921  .00000105  00000+0  00000+0 0  9991
2 51850   0.0552 118.8991 0002627 103.6748 182.3182  1.00271125  1236
"
