"TDRS 3                  
1 19548U 88091B   19203.91878536 -.00000300  00000-0  00000+0 0  9998
2 19548  14.3235   0.4332 0032394 319.5538 262.3064  1.00277336100085
HST                     
1 20580U 90037B   19203.81766292  .00000337  00000-0  95608-5 0  9996
2 20580  28.4705 346.2796 0002798 129.4519  19.4471 15.09246815405968
TDRS 5                  
1 21639U 91054B   19204.16700267  .00000084  00000-0  00000+0 0  9996
2 21639  14.3991  13.7065 0022840   2.9146 176.6287  1.00281028102428
TDRS 6                  
1 22314U 93003B   19203.83235285 -.00000296  00000-0  00000-0 0  9996
2 22314  14.0630  16.7822 0002650  22.7647 154.3685  1.00278686 97168
TDRS 7                  
1 23613U 95035B   19203.52036190 -.00000201  00000-0  00000+0 0  9991
2 23613  14.2404   7.4831 0030503  27.4718 177.0166  1.00268725 87863
ISS (ZARYA)             
1 25544U 98067A   19204.21603009  .00000680  00000-0  19346-4 0  9998
2 25544  51.6423 182.5174 0006744 169.5654   6.7394 15.50996804180845
LANDSAT 7               
1 25682U 99020A   19204.19303577 -.00000006  00000-0  84398-5 0  9998
2 25682  98.1266 270.7558 0001442 100.9472 259.1896 14.57154125 78140
TERRA                   
1 25994U 99068A   19204.21337195  .00000149  00000-0  43184-4 0  9996
2 25994  98.2032 278.2360 0001131  90.1687 269.9659 14.57113362 42229
TDRS 8                  
1 26388U 00034A   19204.08136792 -.00000231  00000-0  00000+0 0  9992
2 26388   8.7171  49.8745 0011130 311.6315  57.4183  1.00266331 69898
TIMED                   
1 26998U 01055B   19204.18549165  .00000005  00000-0  46169-5 0  9996
2 26998  74.0707 230.6303 0001255 315.9665  44.1416 14.88121079955411
TDRS 9                  
1 27389U 02011A   19203.41349826 -.00000289  00000-0  00000+0 0  9994
2 27389   6.8075  70.5506 0019127 265.7879  50.2213  1.00273029 65158
AQUA                    
1 27424U 02022A   19203.90684611  .00000059  00000-0  23047-4 0  9999
2 27424  98.2041 144.2386 0001145   1.8048  89.8103 14.57112558915738
TDRS 10                 
1 27566U 02055A   19203.87902406  .00000089  00000-0  00000-0 0  9996
2 27566   6.3369  55.1061 0006018 310.4284  79.9697  1.00272434 60950
SORCE                   
1 27651U 03004A   19203.86192686 -.00000016  00000-0  12487-4 0  9993
2 27651  39.9969  13.4882 0023765 221.0601 138.8399 14.89014002894909
AURA                    
1 28376U 04026A   19203.89494398  .00000058  00000-0  22942-4 0  9993
2 28376  98.2038 146.3842 0001265  73.1240 287.0098 14.57112059798785
SWIFT                   
1 28485U 04047A   19203.28056162  .00000602  00000-0  10479-4 0  9990
2 28485  20.5556 182.8725 0011190 187.1206 172.9070 15.04406105803533
THEMIS A                
1 30580U 07004A   19203.36456877 -.00000086  00000-0  00000+0 0  9992
2 30580   9.7716  86.5768 8386505 315.5113   2.4735  0.87837396 43797
THEMIS D                
1 30797U 07004D   19202.90928925 -.00000185  00000-0  00000-0 0  9990
2 30797   8.5813  49.8586 8590716 357.4748   0.3884  0.71849998 19252
THEMIS E                
1 30798U 07004E   19203.48406223 -.00000139  00000-0  00000+0 0  9995
2 30798   7.5510  66.3179 8424911 341.9586   1.0908  0.81733216 43886
AIM                     
1 31304U 07015A   19203.70988405  .00000323  00000-0  22256-4 0  9999
2 31304  97.9525  68.2630 0006443  57.1458 303.0392 15.13149948670662
FGRST (GLAST)           
1 33053U 08029A   19203.37656977  .00000378  00000-0  47758-5 0  9992
2 33053  25.5812 194.8169 0012609 134.5929 225.5637 15.11236174613177
WISE                    
1 36119U 09071A   19203.70898144  .00000404  00000-0  16636-4 0  9997
2 36119  97.3694 238.5893 0004217 108.9293 251.2404 15.29657757533232
TDRS 11                 
1 39070U 13004A   19204.16560690  .00000082  00000-0  00000+0 0  9995
2 39070   4.3153 329.8756 0003454  96.9638 118.9726  1.00269519 23703
TDRS 12                 
1 39504U 14004A   19203.85055451 -.00000267  00000-0  00000-0 0  9994
2 39504   5.0694 336.7411 0002229 207.1011  21.7035  1.00276575 18997
GPM-CORE                
1 39574U 14009C   19203.85106526  .00000778  00000-0  15708-4 0  9997
2 39574  65.0041 196.0448 0011478 287.6343  72.3550 15.55498383306611
MMS 1                   
1 40482U 15011A   19194.71760397 -.00002293  00000-0  00000+0 0  9996
2 40482  14.5183 118.3053 9015604  14.6412  81.9539  0.28581536 10246
MMS 2                   
1 40483U 15011B   19199.28700103 -.00001921  00000-0  00000+0 0  9990
2 40483  15.0348 118.5632 9015325  14.5663 191.4786  0.28513045 10238
MMS 3                   
1 40484U 15011C   19193.90211348 -.00002262  00000-0  10000-3 0  9996
2 40484  14.4968 118.3316 9015114  14.6870 358.1466  0.28396727 10226
MMS 4                   
1 40485U 15011D   19202.47034373 -.00001684  00000-0  00000+0 0  9993
2 40485  15.3565 118.8384 9005125  14.4243 158.4969  0.28583917 10243
TDRS 13                 
1 42915U 17047A   19203.79039969 -.00000098  00000-0  00000+0 0  9994
2 42915   6.0728 330.3906 0015033  96.7059 146.2379  1.00272677  7098
JPSS-1                  
1 43013U 17073A   19203.85293560 -.00000005  00000-0  18135-4 0  9990
2 43013  98.7212 141.4933 0001121 105.6064 254.5236 14.19559079 86757
"
