 100 5.71E-07 5.67E-07 5.63E-07            Format des lignes      
 102 4.01E-07 3.97E-07 3.93E-07            Alt   500°     1000°    2000°      <- Température exosphérique
 104 2.82E-07 2.78E-07 2.75E-07            980  8.83E-16 3.11E-15 1.88E-13    <- Masse volumique en kg/m3
 106 1.99E-07 1.95E-07 1.92E-07
 108 1.40E-07 1.37E-07 1.35E-07
 110 9.94E-08 9.72E-08 9.53E-08
 115 4.42E-08 4.39E-08 4.35E-08
 120 2.17E-08 2.26E-08 2.31E-08
 125 1.16E-08 1.29E-08 1.37E-08
 130 6.69E-09 7.97E-09 8.83E-09
 135 4.12E-09 5.26E-09 6.06E-09
 140 2.68E-09 3.66E-09 4.36E-09
 145 1.81E-09 2.66E-09 3.26E-09
 150 1.27E-09 1.99E-09 2.51E-09
 155 9.04E-10 1.53E-09 1.98E-09
 160 6.58E-10 1.21E-09 1.60E-09
 170 3.63E-10 7.84E-10 1.10E-09
 180 2.10E-10 5.34E-10 7.95E-10
 190 1.25E-10 3.76E-10 5.99E-10
 200 7.73E-11 2.72E-10 4.66E-10
 210 4.89E-11 2.00E-10 3.72E-10
 220 3.16E-11 1.50E-10 3.02E-10
 230 2.08E-11 1.14E-10 2.49E-10
 240 1.39E-11 8.74E-11 2.08E-10
 250 9.36E-12 6.79E-11 1.76E-10
 260 6.39E-12 5.32E-11 1.50E-10
 270 4.40E-12 4.20E-11 1.28E-10
 280 3.05E-12 3.34E-11 1.11E-10
 290 2.13E-12 2.68E-11 9.61E-11
 300 1.50E-12 2.16E-11 8.37E-11
 310 1.06E-12 1.75E-11 7.32E-11
 320 7.49E-13 1.42E-11 6.42E-11
 330 5.34E-13 1.16E-11 5.65E-11
 340 3.83E-13 9.53E-12 4.99E-11
 350 2.76E-13 7.85E-12 4.42E-11
 360 2.00E-13 6.48E-12 3.92E-11
 370 1.46E-13 5.37E-12 3.49E-11
 380 1.08E-13 4.47E-12 3.11E-11
 390 8.03E-14 3.72E-12 2.77E-11
 400 6.05E-14 3.11E-12 2.48E-11
 420 3.58E-14 2.18E-12 2.00E-11
 440 2.26E-14 1.54E-12 1.62E-11
 460 1.53E-14 1.10E-12 1.32E-11
 480 1.11E-14 7.88E-13 1.08E-11
 500 8.59E-15 5.68E-13 8.86E-12
 520 7.20E-15 4.11E-13 7.32E-12
 540 5.81E-15 3.00E-13 6.07E-12
 560 4.99E-15 2.19E-13 5.05E-12
 580 4.35E-15 1.62E-13 4.22E-12
 600 3.89E-15 1.20E-13 3.54E-12
 620 3.43E-15 8.95E-14 2.98E-12
 640 3.07E-15 6.74E-14 2.51E-12
 660 2.78E-15 5.11E-14 2.12E-12
 680 2.52E-15 3.92E-14 1.80E-12
 700 2.30E-15 3.03E-14 1.53E-12
 720 2.10E-15 2.38E-14 1.30E-12
 740 1.93E-15 1.89E-14 1.11E-12
 760 1.78E-15 1.52E-14 9.47E-13
 780 1.65E-15 1.24E-14 8.11E-13
 800 1.53E-15 1.02E-14 6.96E-13
 820 1.42E-15 8.55E-15 5.98E-13
 840 1.33E-15 7.26E-15 5.15E-13
 860 1.25E-15 6.24E-15 4.44E-13
 880 1.17E-15 5.43E-15 3.83E-13
 900 1.10E-15 4.77E-15 3.31E-13
 920 1.04E-15 4.24E-15 2.87E-13
 940 9.82E-16 3.80E-15 2.49E-13
 960 9.30E-16 3.42E-15 2.16E-13
 980 8.83E-16 3.11E-15 1.88E-13
1000 8.39E-16 2.84E-15 1.64E-13
1050 7.45E-16 2.30E-15 1.17E-13
1100 6.66E-16 1.90E-15 8.44E-14
1150 5.99E-16 1.59E-15 6.15E-14
1200 5.43E-16 1.35E-15 4.53E-14
1250 4.93E-16 1.15E-15 3.38E-14
1300 4.50E-16 9.82E-16 2.55E-14
1350 4.12E-16 8.45E-16 1.96E-14
1400 3.78E-16 7.29E-16 1.52E-14
1450 3.48E-16 6.32E-16 1.20E-14
1500 3.20E-16 5.50E-16 9.64E-15
1600 2.73E-16 4.20E-16 6.51E-15
1700 2.35E-16 3.26E-16 4.66E-15
1800 2.02E-16 2.57E-16 3.52E-15
1900 1.75E-16 2.05E-16 2.77E-15
2000 1.52E-16 1.66E-16 2.26E-15
2100 1.33E-16 1.37E-16 1.88E-15
2200 1.16E-16 1.14E-16 1.60E-15
2300 1.02E-16 9.61E-17 1.38E-15
2400 9.00E-17 8.22E-17 1.20E-15
2500 7.95E-17 7.12E-17 1.05E-15
