1991	01	205.5
1991	02	206.3
1991	03	205.9
1991	04	206.8
1991	05	207.1
1991	06	207.4
1991	07	207.7
1991	08	206.8
1991	09	203.9
1991	10	199.7
1991	11	195.4
1991	12	188.9
1992	01	181.8
1992	02	174.8
1992	03	168.5
1992	04	162.9
1992	05	158.8
1992	06	154.2
1992	07	146.6
1992	08	138.9
1992	09	133.7
1992	10	130.5
1992	11	128.1
1992	12	127.3
1993	01	125.6
1993	02	123.0
1993	03	120.6
1993	04	118.1
1993	05	114.8
1993	06	111.3
1993	07	109.6
1993	08	107.6
1993	09	103.9
1993	10	100.4
1993	11	097.5
1993	12	094.8
1994	01	092.7
1994	02	091.2
1994	03	090.2
1994	04	089.3
1994	05	088.2
1994	06	086.7
1994	07	084.5
1994	08	082.5
1994	09	081.7
1994	10	081.5
1994	11	081.2
1994	12	081.0
1995	01	080.6
1995	02	080.2
1995	03	079.9
1995	04	079.2
1995	05	078.5
1995	06	077.7
1995	07	076.9
1995	08	076.0
1995	09	074.8
1995	10	073.8
1995	11	073.2
1995	12	072.8
1996	01	072.4
1996	02	072.2
1996	03	072.1
1996	04	071.6
1996	05	071.4
1996	06	071.8
1996	07	072.0
1996	08	072.1
1996	09	072.3
1996	10	072.6
1996	11	073.0
1996	12	073.3
1997	01	073.4
1997	02	073.7
1997	03	075.1
1997	04	076.8
1997	05	078.4
1997	06	080.1
1997	07	081.8
1997	08	083.4
1997	09	085.7
1997	10	088.6
1997	11	091.3
1997	12	094.2
1998	01	097.5
1998	02	101.7
1998	03	105.8
1998	04	108.9
1998	05	112.0
1998	06	115.8
1998	07	120.0
1998	08	124.1
1998	09	126.8
1998	10	127.9
1998	11	130.0
1998	12	134.3
1999	01	139.0
1999	02	142.6
1999	03	144.0
1999	04	145.8
1999	05	149.9
1999	06	152.9
1999	07	154.4
1999	08	156.3
1999	09	161.0
1999	10	167.2
1999	11	171.5
1999	12	173.4
2000	01	175.5
2000	02	176.8
2000	03	178.4
2000	04	180.5
2000	05	180.0
2000	06	179.7
2000	07	180.2
2000	08	179.5
2000	09	177.1
2000	10	175.6
2000	11	173.9
2000	12	172.1
2001	01	168.8
2001	02	165.8
2001	03	167.9
2001	04	171.7
2001	05	174.8
2001	06	178.8
2001	07	180.5
2001	08	179.4
2001	09	177.6
2001	10	174.4
2001	11	172.1
2001	12	169.9
2002	01	168.2
2002	02	166.8
2002	03	160.9
2002	04	152.9
2002	05	145.6
2002	06	137.0
2002	07	131.0
2002	08	128.7
2002	09	126.4
2002	10	124.1
2002	11	121.8
2002	12	119.5
2003	01	117.2
2003	02	115.0
2003	03	112.8
2003	04	110.6
2003	05	108.5
2003	06	106.5
2003	07	104.4
2003	08	102.5
2003	09	100.6
2003	10	098.8
2003	11	097.0
2003	12	095.3
2004	01	093.7
2004	02	092.1
2004	03	090.6
2004	04	089.2
2004	05	087.8
2004	06	086.5
2004	07	085.3
2004	08	084.1
2004	09	083.0
2004	10	081.9
2004	11	080.9
2004	12	080.0
2005	01	079.1
2005	02	078.2
2005	03	077.5
2005	04	076.7
2005	05	076.0
2005	06	075.4
2005	07	074.8
2005	08	074.2
2005	09	073.7
2005	10	073.3
2005	11	072.9
2005	12	072.5
2006	01	072.1
2006	02	071.8
2006	03	071.4
2006	04	071.1
2006	05	070.9
2006	06	070.8
2006	07	070.7
2006	08	070.5
2006	09	070.4
2006	10	070.3
2006	11	070.1
2006	12	069.6
2007	01	069.8
2007	02	069.9
2007	03	070.1
2007	04	070.3
2007	05	070.7
2007	06	071.3
2007	07	072.0
2007	08	073.0
2007	09	074.3
2007	10	075.7
2007	11	077.4
2007	12	079.4
