"SAUDISAT 1C             
1 27607U 02058C   22178.61899165  .00000319  00000+0  64422-4 0  9996
2 27607  64.5549 270.7934 0078971 292.4740  66.8014 14.76144791 49876
SAUDISAT 2              
1 28371U 04025F   22178.88084396  .00000118  00000+0  38512-4 0  9990
2 28371  98.3791 135.6458 0026897  73.0993 287.3147 14.54564423954801
SAUDISAT 3              
1 31118U 07012B   22179.13410742  .00000083  00000+0  22117-4 0  9994
2 31118  97.9698 125.9210 0015583 156.9401 203.2507 14.69333268814728
PISAT                   
1 41784U 16059B   22178.87151803  .00000385  00000+0  81746-4 0  9993
2 41784  97.9147 221.8172 0032859 134.9412 225.4465 14.63922049307218
FLYING LAPTOP           
1 42831U 17042G   22178.72492658  .00000259  00000+0  30779-4 0  9990
2 42831  97.4225  32.5861 0013389 339.9623  20.1086 14.91800223269625
SALSAT                  
1 46495U 20068K   22178.80431941  .00000974  00000+0  73827-4 0  9994
2 46495  97.7294 120.1079 0015030 240.3370 119.6360 15.04547955 95742
"
