"SCD 1                   
1 22490U 93009B   19203.60137894  .00000216  00000-0  90773-5 0  9991
2 22490  24.9693 269.9866 0043149 134.9915 343.3115 14.44554325396118
TECHSAT 1B (GO-32)      
1 25397U 98043D   19203.77601694 -.00000017  00000-0  11606-4 0  9992
2 25397  98.6896 143.5095 0000680   2.7339 357.3844 14.23667929 92508
SCD 2                   
1 25504U 98060A   19203.94182111  .00000204  00000-0  65557-5 0  9990
2 25504  24.9955 115.8525 0017341 161.4072 278.3993 14.44071958 95497
LANDSAT 7               
1 25682U 99020A   19204.19303577 -.00000006  00000-0  84398-5 0  9998
2 25682  98.1266 270.7558 0001442 100.9472 259.1896 14.57154125 78140
DLR-TUBSAT              
1 25757U 99029B   19204.21811931 -.00000013  00000-0  81652-5 0  9999
2 25757  98.4113 126.2886 0015378 115.5082 244.7705 14.51404272 67599
TERRA                   
1 25994U 99068A   19204.21337195  .00000149  00000-0  43184-4 0  9996
2 25994  98.2032 278.2360 0001131  90.1687 269.9659 14.57113362 42229
MAROC-TUBSAT            
1 27004U 01056D   19203.65817519 -.00000026  00000-0  20121-4 0  9991
2 27004  99.4697 336.7191 0020325 149.4967 280.0466 13.70135675880876
AQUA                    
1 27424U 02022A   19203.90684611  .00000059  00000-0  23047-4 0  9999
2 27424  98.2041 144.2386 0001145   1.8048  89.8103 14.57112558915738
IRS-P6 (RESOURCESAT-1)  
1 28051U 03046A   19204.14845944 -.00000005  00000-0  13795-4 0  9999
2 28051  98.5172 281.2867 0057047 286.6427  72.8503 14.34169776819047
SHIYAN 1 (SY-1)         
1 28220U 04012A   19203.47100466 -.00000651  00000-0 -47649-4 0  9992
2 28220  97.8018 165.7971 0008409  53.2684 306.9311 14.99848192831116
FORMOSAT-2 (ROCSAT 2)   
1 28254U 04018A   19204.14727843  .00000068  00000-0  73966-4 0  9995
2 28254  98.7668 247.0652 0002615 150.6037 274.6844 14.00726041775828
AURA                    
1 28376U 04026A   19203.89494398  .00000058  00000-0  22942-4 0  9993
2 28376  98.2038 146.3842 0001265  73.1240 287.0098 14.57112059798785
IRS-P5 (CARTOSAT-1)     
1 28649U 05017A   19204.17689355 -.00000018  00000-0  41516-5 0  9994
2 28649  97.8532 274.3129 0002686  84.0710 276.0822 14.83645209769545
SINAH 1                 
1 28893U 05043D   19203.79904658 -.00000008  00000-0  74777-5 0  9991
2 28893  97.9785 339.9567 0013880 261.2766  98.6863 14.61507098732024
EROS B                  
1 29079U 06014A   19204.18886756  .00000706  00000-0  32132-4 0  9991
2 29079  97.4249 322.6725 0003857  36.6953  81.4075 15.23951438734950
RESURS-DK 1             
1 29228U 06021A   19203.80494774  .00000005  00000-0  77565-5 0  9990
2 29228  69.9365 309.6834 0007640 257.1895 102.8412 15.02451076723089
ARIRANG-2 (KOMPSAT-2)   
1 29268U 06031A   19204.18084195 -.00000039  00000-0  15117-5 0  9992
2 29268  98.0268  95.4227 0019068 116.0833 244.2329 14.62439060692948
LAPAN-TUBSAT            
1 29709U 07001A   19204.18418809 -.00000011  00000-0  51965-5 0  9994
2 29709  97.8103 165.6206 0014059 107.4887 252.7867 14.82180678677447
CARTOSAT-2 (IRS-P7)     
1 29710U 07001B   19204.19924058  .00000086  00000-0  18780-4 0  9993
2 29710  97.9694 262.9313 0001151  98.7060 261.4303 14.78645399676395
HAIYANG-1B              
1 31113U 07010A   19203.85617643 -.00000008  00000-0  13167-4 0  9993
2 31113  98.4513 251.6943 0015064 107.7855 252.4973 14.30226386640917
COSMO-SKYMED 1          
1 31598U 07023A   19204.14870753  .00000205  00000-0  32353-4 0  9996
2 31598  97.8907  27.0354 0001408  93.6992 266.4373 14.82155307655902
TERRASAR-X              
1 31698U 07026A   19204.08985804  .00000395  00000-0  21996-4 0  9998
2 31698  97.4459 210.8249 0001385  98.2356 296.5563 15.19149568671147
WORLDVIEW-1 (WV-1)      
1 32060U 07041A   19203.93988847  .00000349  00000-0  17094-4 0  9995
2 32060  97.3945 323.1221 0002333  87.2177 272.9328 15.24417275658917
YAOGAN 3                
1 32289U 07055A   19204.18743121 -.00000132  00000-0 -10254-4 0  9998
2 32289  98.0017 214.7986 0001371  73.3768 286.7602 14.80965085632103
COSMO-SKYMED 2          
1 32376U 07059A   19204.18243305 -.00000439  00000-0 -48628-4 0  9994
2 32376  97.8909  27.0697 0001480  87.4273 272.7082 14.82154298628659
RADARSAT-2              
1 32382U 07061A   19204.23693287  .00000015  00000-0  22883-4 0  9991
2 32382  98.5749 210.6428 0001099  93.3997 102.0194 14.29985154605774
CARTOSAT-2A             
1 32783U 08021A   19204.17760507 -.00000243  00000-0 -25996-4 0  9999
2 32783  97.9695 263.2709 0012948   3.0068 357.1223 14.78652554606338
JASON-2 (OSTM)          
1 33105U 08032A   19204.14482248 -.00000033  00000-0  11671-3 0  9990
2 33105  66.0425 311.7077 0008234 266.8749 162.2466 12.87627967519201
RAPIDEYE 2              
1 33312U 08040A   19203.70711983  .00007687  00000-0  92972-3 0  9995
2 33312  97.7414 271.4527 0012557  11.5809  85.9886 14.83909175588617
RAPIDEYE 5              
1 33313U 08040B   19203.74155272 -.00013294  00000-0 -15940-2 0  9995
2 33313  97.7466 270.3753 0017765 257.5499 256.4985 14.83890576588560
RAPIDEYE 1              
1 33314U 08040C   19203.71914900  .00073557  00000-0  87277-2 0  9992
2 33314  97.7468 271.2483 0024086  33.2468  63.5783 14.83910815588609
RAPIDEYE 3              
1 33315U 08040D   19203.76434123 -.00002872  00000-0 -33939-3 0  9993
2 33315  97.7472 270.2865 0012887 330.9625 177.3934 14.83895729588570
RAPIDEYE 4              
1 33316U 08040E   19204.12880931  .00002101  00000-0  25902-3 0  9991
2 33316  97.7514 270.5216 0011467 275.3944  84.6040 14.83903587588626
HUANJING 1A (HJ-1A)     
1 33320U 08041A   19204.15339447  .00000070  00000-0  16952-4 0  9990
2 33320  97.8360 261.5745 0026989  69.1703 291.2402 14.77031098585846
HUANJING 1B (HJ-1B)     
1 33321U 08041B   19204.17926067  .00000051  00000-0  14334-4 0  9994
2 33321  97.8433 263.5114 0036032  87.5383 272.9956 14.77145097585843
GEOEYE 1                
1 33331U 08042A   19204.22168635 -.00000025  00000-0  42029-5 0  9996
2 33331  98.0952 278.1667 0009731  24.2270 335.9404 14.64394950581201
THEOS                   
1 33396U 08049A   19204.21417414  .00000169  00000-0  10000-3 0  9995
2 33396  98.6826 270.5894 0001267 100.7938 350.8573 14.20050734560192
COSMO-SKYMED 3          
1 33412U 08054A   19204.16558555  .00000054  00000-0  13325-4 0  9993
2 33412  97.8901  27.0577 0001467  91.1888 268.9462 14.82153191581118
YAOGAN 4                
1 33446U 08061A   19204.01294089  .00000030  00000-0  11152-4 0  9991
2 33446  97.6769 169.5008 0015587 338.0230  22.0310 14.76963238573057
GOSAT (IBUKI)           
1 33492U 09002A   19203.91503527 -.00000024  00000-0  41059-5 0  9990
2 33492  98.0379 315.6091 0001635  86.2186 273.9206 14.67564877561679
YAOGAN 6                
1 34839U 09021A   19204.13678552  .00000282  00000-0  13248-4 0  9996
2 34839  97.0526 226.1137 0029747 116.3745 244.0554 15.26600827569412
DEIMOS-1                
1 35681U 09041A   19204.22371689 -.00000088  00000-0 -64566-5 0  9991
2 35681  97.8579  84.9236 0002545  57.0050 303.1391 14.71792355535811
DUBAISAT-1              
1 35682U 09041B   19204.13866329  .00000104  00000-0  25648-4 0  9996
2 35682  97.7292  35.6733 0010235 221.4167 138.6264 14.68739909534630
OCEANSAT-2              
1 35931U 09051A   19203.89353332  .00000032  00000-0  19352-4 0  9996
2 35931  98.3016 298.5481 0001778  31.9197 328.2105 14.50869575520389
WORLDVIEW-2 (WV-2)      
1 35946U 09055A   19204.23956970 -.00000025  00000-0  61912-5 0  9995
2 35946  98.4340 279.2675 0000507 244.6278 115.4879 14.37672451513576
SMOS                    
1 36036U 09059A   19204.14368853  .00000013  00000-0  18044-4 0  9990
2 36036  98.4449  30.9010 0001302  91.7324 268.4013 14.39757545510834
YAOGAN 7                
1 36110U 09069A   19204.14811022 -.00000012  00000-0  62821-5 0  9998
2 36110  98.2717  27.7161 0023785 188.1490 171.9330 14.75123768517806
TANDEM-X                
1 36605U 10030A   19204.08994829  .00000658  00000-0  34504-4 0  9998
2 36605  97.4463 210.8273 0001488  94.1000 300.5419 15.19149044503887
CARTOSAT-2B             
1 36795U 10035A   19204.14660632  .00000039  00000-0  12465-4 0  9997
2 36795  97.9679 262.8693 0015755  72.4064 287.8875 14.78649068487378
YAOGAN 10               
1 36834U 10038A   19204.15970162 -.00000011  00000-0  53663-5 0  9994
2 36834  97.9669 204.2356 0001350  73.6016 286.5344 14.80924035483841
COSMO-SKYMED 4          
1 37216U 10060A   19204.12755805 -.00000018  00000-0  42598-5 0  9998
2 37216  97.8904  27.0150 0001320  75.1334 285.0013 14.82156457471196
RESOURCESAT-2           
1 37387U 11015A   19204.19648729 -.00000005  00000-0  17744-4 0  9991
2 37387  98.7143 278.8588 0003120 253.6066 106.4773 14.21631153428517
HAIYANG 2A              
1 37781U 11043A   19204.19935825 -.00000420  00000-0 -37008-3 0  9992
2 37781  99.3173 212.5617 0001385 103.1294 257.0027 13.78720911399532
RASAT                   
1 37791U 11044D   19204.08444286  .00000009  00000-0  10778-4 0  9995
2 37791  98.1196 296.4922 0021020 228.3431 131.5969 14.64725670423886
MEGHA-TROPIQUES         
1 37838U 11058A   19203.44185249  .00000263  00000-0 -61249-6 0  9996
2 37838  19.9761 209.1340 0009515 171.2922 188.7648 14.09689255401216
SRMSAT                  
1 37841U 11058D   19203.32884731  .00000277  00000-0  71206-5 0  9996
2 37841  19.9706 188.2681 0011776 205.2780 293.7659 14.10635318401443
YAOGAN 13               
1 37941U 11072A   19204.18863733  .00000187  00000-0  12528-4 0  9998
2 37941  97.5283 135.8367 0003129 106.8353  29.9513 15.18026587423869
PLEIADES 1A             
1 38012U 11076F   19204.21144916 -.00000028  00000-0  39079-5 0  9997
2 38012  98.1977 278.4510 0001405  81.3957 278.7409 14.58550164404528
ZIYUAN 1-02C (ZY 1-02C) 
1 38038U 11079A   19204.17960844 -.00000046  00000-0 -25169-6 0  9996
2 38038  98.7373 248.7617 0008063 155.9973 204.1610 14.35204337397399
ZIYUAN 3 (ZY 3)         
1 38046U 12001A   19204.15154672  .00000211  00000-0  12506-4 0  9994
2 38046  97.4534 277.4864 0001905 265.4622 178.0274 15.21296905418401
RISAT-1                 
1 38248U 12017A   19204.09932508  .00000374  00000-0  27037-4 0  9995
2 38248  97.5694 212.3453 0002899 313.9869  46.1121 15.09844498398786
ARIRANG-3 (KOMPSAT-3)   
1 38338U 12025B   19204.15290518  .00000020  00000-0  13330-4 0  9998
2 38338  98.1624 141.5750 0011017  92.9530 267.2935 14.61761805383072
KANOPUS-V 1             
1 38707U 12039A   19204.16094700  .00000206  00000-0  13032-4 0  9994
2 38707  97.4555 122.3194 0001464  87.3306  42.1414 15.19029986388360
EXACTVIEW-1 (ADS-1B)    
1 38709U 12039C   19204.02055189 -.00000022  00000-0  11306-4 0  9998
2 38709  99.1377 219.7536 0009942 215.5093 144.5429 14.23995942363826
SPOT 6                  
1 38755U 12047A   19204.15890820 -.00000037  00000-0  19326-5 0  9998
2 38755  98.2090 270.8323 0001411  96.6203 263.5164 14.58546942365599
PLEIADES 1B             
1 39019U 12068A   19204.10852157 -.00000032  00000-0  29626-5 0  9990
2 39019  98.1965 278.3305 0001289  86.6466 273.4884 14.58556471353368
GOKTURK 2               
1 39030U 12073A   19204.18033884  .00000007  00000-0  87631-5 0  9996
2 39030  97.9896  93.1419 0002378 108.6945 251.4525 14.72741330353293
LANDSAT 8               
1 39084U 13008A   19204.09824390 -.00000473  00000-0 -94882-4 0  9998
2 39084  98.2227 273.6342 0001305  97.2942 262.8402 14.57102428342596
SARAL                   
1 39086U 13009A   19203.89447034 -.00000035  00000-0  32174-5 0  9994
2 39086  98.5420  29.5484 0001866 115.3035 244.8342 14.32007858334697
GAOFEN 1                
1 39150U 13018A   19204.16239490  .00000019  00000-0  10036-4 0  9995
2 39150  97.8992 283.7729 0020294 103.8863 256.4612 14.76533844336270
VNREDSAT 1              
1 39160U 13021B   19204.16187609  .00000034  00000-0  15966-4 0  9998
2 39160  98.1817 279.2448 0001036 115.5151 244.6183 14.62873725331594
ARIRANG-5 (KOMPSAT-5)   
1 39227U 13042A   19204.12030725 -.00000306  00000-0 -17522-4 0  9991
2 39227  97.6196  27.8135 0002388  81.7360  50.8633 15.04511144324858
YAOGAN 18               
1 39363U 13059A   19204.15107300  .00000368  00000-0  21162-4 0  9998
2 39363  97.2951 260.1974 0002574  63.7172  20.8051 15.18167020317527
SKYSAT-1                
1 39418U 13066C   19203.83021967  .00000213  00000-0  22493-4 0  9992
2 39418  97.6494 285.0415 0020845 228.2706 131.6734 14.98835164309755
DUBAISAT-2              
1 39419U 13066D   19204.14204420  .00000642  00000-0  65274-4 0  9995
2 39419  97.5897 265.3082 0012675 226.8742 133.1422 14.94013513308852
GPM-CORE                
1 39574U 14009C   19203.85106526  .00000778  00000-0  15708-4 0  9997
2 39574  65.0041 196.0448 0011478 287.6343  72.3550 15.55498383306611
SENTINEL-1A             
1 39634U 14016A   19204.13317864 -.00000003  00000-0  90224-5 0  9992
2 39634  98.1821 210.8355 0001199  81.1974 278.9367 14.59197838282391
KAZEOSAT 1              
1 39731U 14024A   19204.17651408 -.00000009  00000-0  10428-4 0  9991
2 39731  98.3531 279.9391 0001015  93.9621 266.1695 14.42044958275281
ALOS-2                  
1 39766U 14029A   19204.19227181  .00000090  00000-0  18947-4 0  9996
2 39766  97.9227 300.5235 0001384  90.0846 270.0534 14.79471918278863
KAZEOSAT 2              
1 40010U 14033A   19204.13889179  .00000018  00000-0  88983-5 0  9998
2 40010  97.8362 102.5958 0015260 305.2540  54.7251 14.82065592275397
HODOYOSHI-4             
1 40011U 14033B   19204.11512881  .00000051  00000-0  13279-4 0  9992
2 40011  97.8135  96.3984 0025785 300.7340  59.1346 14.81114621275128
DEIMOS-2                
1 40013U 14033D   19204.17407270  .00000050  00000-0  12158-4 0  9999
2 40013  97.8383 107.6794 0001836  42.2994 317.8375 14.84546384275869
HODOYOSHI-3             
1 40015U 14033F   19204.20938451  .00000013  00000-0  88151-5 0  9991
2 40015  97.7832  86.4557 0035969 314.9609  44.8687 14.78505403274655
SPOT 7                  
1 40053U 14034A   19204.05464388 -.00000036  00000-0  20513-5 0  9994
2 40053  98.2255 270.3514 0000874  83.8744 276.2556 14.58536734269512
SKYSAT-2                
1 40072U 14037D   19203.90443671  .00000040  00000-0  12687-4 0  9999
2 40072  98.4314 359.4714 0007660 110.7747 249.4285 14.81194148272234
WORLDVIEW-3 (WV-3)      
1 40115U 14048A   19204.20599285  .00000049  00000-0  11953-4 0  9990
2 40115  97.8105 282.2260 0001012  44.3268 315.8034 14.85021210267784
GAOFEN 2                
1 40118U 14049A   19204.19611656  .00000028  00000-0  10367-4 0  9994
2 40118  97.8703 283.3441 0008000 154.2534 205.9085 14.80634263266209
YAOGAN 21               
1 40143U 14053A   19204.16492969  .00000380  00000-0  18903-4 0  9993
2 40143  97.4816 267.8007 0017472 354.0453  90.1732 15.23504510271114
YAOGAN 22               
1 40275U 14063A   19204.09235593 -.00000045  00000-0  00000+0 0  9993
2 40275 100.4717 316.3440 0006737 129.5389 230.6313 13.15336248228333
ASNARO                  
1 40298U 14070A   19204.24222706  .00000330  00000-0  18704-4 0  9996
2 40298  97.4422 286.6285 0001655  79.8016 342.0610 15.19577187261194
HODOYOSHI-1             
1 40299U 14070B   19204.12730977  .00000269  00000-0  14240-4 0  9990
2 40299  97.3487 283.1668 0011257 282.9215 142.6855 15.23390122261517
QSAT-EOS                
1 40301U 14070D   19204.19047098  .00000717  00000-0  30538-4 0  9992
2 40301  97.3259 280.7075 0024137 277.4836 134.3528 15.25981624261556
YAOGAN 23               
1 40305U 14071A   19204.15711149  .00000397  00000-0  22909-4 0  9995
2 40305  97.4928 141.2452 0001817 105.7991   7.7576 15.17922329259628
YAOGAN 24               
1 40310U 14072A   19204.17893768 -.00000024  00000-0  37276-5 0  9994
2 40310  97.8614 329.2912 0018529 109.9484 250.3732 14.76292773251809
CBERS 4                 
1 40336U 14079A   19204.18693786 -.00000028  00000-0  57567-5 0  9997
2 40336  98.6024 272.6381 0001218  63.4821 296.6494 14.35392397242309
RESURS P2               
1 40360U 14087A   19204.16934559  .00000276  00000-0  10986-4 0  9994
2 40360  97.2590 294.2180 0007807 292.1903 155.1384 15.33147676255700
YAOGAN 26               
1 40362U 14088A   19204.20362677  .00000357  00000-0  17773-4 0  9999
2 40362  97.2863 277.4911 0008594 205.6935 210.1872 15.23630580254587
SMAP                    
1 40376U 15003A   19204.20008721  .00000005  00000-0  99595-5 0  9992
2 40376  98.1224 210.6041 0000678  47.3904 312.7359 14.63376800238922
KOMPSAT-3A              
1 40536U 15014A   19204.15885390  .00000388  00000-0  26185-4 0  9999
2 40536  97.5532 142.1366 0010201 194.3015 279.4440 15.12280811238801
SENTINEL-2A             
1 40697U 15028A   19204.19358612 -.00000009  00000-0  13299-4 0  9991
2 40697  98.5660 278.1717 0000884  82.7336 277.3951 14.30818191213235
GAOFEN 8                
1 40701U 15030A   19204.17126453  .00000398  00000-0  19637-4 0  9996
2 40701  97.4384 323.8289 0009742 223.2202 256.3480 15.23560022226957
CARBONITE 1 (CBNT-1)    
1 40718U 15032D   19204.17190633  .00000073  00000-0  18388-4 0  9999
2 40718  97.8811  89.7977 0016183 191.6675 168.4161 14.74708570217131
YAOGAN 27               
1 40878U 15040A   19204.12080656 -.00000044  00000-0  00000+0 0  9999
2 40878 100.2852 257.4706 0007819 258.5798 101.4441 13.15962177187561
GAOFEN 9                
1 40894U 15047A   19204.21576318 -.00000052  00000-0  00000+0 0  9998
2 40894  97.9166 285.6405 0034394  35.4875 324.8618 14.76287375207753
LAPAN-A2                
1 40931U 15052B   19202.51269834  .00000614  00000-0 -34879-5 0  9990
2 40931   6.0001 182.6065 0012573 262.3126  97.5538 14.76609943206121
YAOGAN 28               
1 41026U 15064A   19204.04586688  .00000250  00000-0  13383-4 0  9999
2 41026  97.4117 333.9384 0001664 132.1359 317.2489 15.23500632206782
YAOGAN 29               
1 41038U 15069A   19204.13145928  .00000001  00000-0  69581-5 0  9991
2 41038  97.9780 188.2982 0000648 106.8392 253.2893 14.80412369197404
KENT RIDGE 1            
1 41167U 15077B   19203.79270720  .00000812  00000-0  95181-5 0  9998
2 41167  14.9779  10.6832 0011204 121.0135 357.1069 15.09046095198759
TELEOS 1                
1 41169U 15077D   19203.76714630  .00000972  00000-0  18258-4 0  9996
2 41169  14.9816   0.3430 0010368 136.9152 341.7795 15.10262261198849
GAOFEN 4                
1 41194U 15083A   19203.93433160 -.00000336  00000-0  00000-0 0  9993
2 41194   0.0542 106.7699 0003978  97.1949 178.5059  1.00273271 13211
JASON-3                 
1 41240U 16002A   19203.85721194 -.00000032  00000-0  12704-3 0  9995
2 41240  66.0427 331.8157 0007986 268.9394  91.0706 12.80931245164219
SENTINEL-3A             
1 41335U 16011A   19204.18776402  .00000000  00000-0  18193-4 0  9992
2 41335  98.6220 270.6682 0001407  91.1658 268.9684 14.26738391178584
SENTINEL-1B             
1 41456U 16025A   19204.16698121 -.00000064  00000-0 -38121-5 0  9996
2 41456  98.1821 210.6949 0001193  85.2988 274.8348 14.59197349172565
ZIYUAN 3-2 (ZY 3-2)     
1 41556U 16033A   19204.18893868  .00000318  00000-0  17283-4 0  9998
2 41556  97.3964 280.8153 0003989  87.7767 324.1661 15.21298377174706
NUSAT-1 (FRESCO)        
1 41557U 16033B   19204.18011886  .00000763  00000-0  31298-4 0  9997
2 41557  97.4180 291.4807 0014133 169.3381 190.8160 15.27260965175356
NUSAT-2 (BATATA)        
1 41558U 16033C   19204.17163893  .00000758  00000-0  29396-4 0  9993
2 41558  97.4208 292.6300 0013159 169.3814 190.7707 15.29168901175408
CARTOSAT-2C             
1 41599U 16040A   19204.12785581 -.00002763  00000-0 -12792-3 0  9996
2 41599  97.4965 262.1331 0012621 282.9859 160.7175 15.19191615170940
SKYSAT-C1               
1 41601U 16040C   19204.17385978  .00000254  00000-0  13478-4 0  9995
2 41601  97.4058 282.3493 0001225  38.6169  45.0729 15.23697404171312
LAPAN-A3                
1 41603U 16040E   19204.14639788  .00000113  00000-0  84532-5 0  9999
2 41603  97.3579 262.0062 0011860 280.7143 163.5011 15.19725697170978
BIROS                   
1 41604U 16040F   19203.79126021  .00000204  00000-0  12050-4 0  9997
2 41604  97.3621 264.3314 0010693 265.6201  94.3813 15.21741048171087
GAOFEN 3                
1 41727U 16049A   19204.16357225 -.00000049  00000-0 -17327-5 0  9998
2 41727  98.4123 211.3615 0000673 104.9755 255.1508 14.42214228155261
SKYSAT-C4               
1 41771U 16058B   19204.17771158  .00000246  00000-0  13204-4 0  9999
2 41771  97.3990 274.8199 0001712  89.9054 270.2379 15.23544433158250
SKYSAT-C5               
1 41772U 16058C   19204.20522708  .00000174  00000-0  10254-4 0  9991
2 41772  97.3976 274.3907 0001495  71.4943 353.3234 15.23398733158251
SKYSAT-C2               
1 41773U 16058D   19204.15345004  .00000274  00000-0  14450-4 0  9991
2 41773  97.4012 274.9594 0001670  98.4221 261.7205 15.23426666158252
SKYSAT-C3               
1 41774U 16058E   19204.16680520  .00000255  00000-0  13621-4 0  9996
2 41774  97.4022 274.9823 0002050  77.6754 282.4712 15.23493824158255
ALSAT 1B                
1 41785U 16059C   19204.14877033 -.00000002  00000-0  88832-5 0  9992
2 41785  98.0624 263.3726 0030027 273.3994  86.3779 14.63323258150591
PATHFINDER 1            
1 41787U 16059E   19204.13947326  .00000041  00000-0  17125-4 0  9994
2 41787  98.0636 264.0610 0029579 272.2401  87.5417 14.63676646150625
SCATSAT 1               
1 41790U 16059H   19204.06395366  .00000011  00000-0  13709-4 0  9992
2 41790  98.2067 248.3133 0004514 206.7931 153.3040 14.50885566149313
WORLDVIEW-4 (WV-4)      
1 41848U 16067A   19203.96831693  .00001408  00000-0  80444-4 0  9992
2 41848  97.8581 285.4990 0021666 150.4600 209.7861 15.14305520146111
GOKTURK 1A              
1 41875U 16073A   19204.15255776  .00000025  00000-0  13963-4 0  9999
2 41875  98.1307  98.2092 0001186  80.0175 280.1170 14.62780382140276
RESOURCESAT-2A          
1 41877U 16074A   19204.15131255  .00000002  00000-0  20638-4 0  9999
2 41877  98.6317 276.2593 0000581 102.9715 257.1535 14.21664220136114
CARTOSAT-2D             
1 41948U 17008A   19204.01814078  .00000216  00000-0  13409-4 0  9997
2 41948  97.3930 263.6411 0008187  72.7043 287.5088 15.19272479134798
SENTINEL-2B             
1 42063U 17013A   19204.15865937 -.00000002  00000-0  16031-4 0  9995
2 42063  98.5667 278.1502 0001115  96.9913 263.1408 14.30818515124140
ZHUHAI-1 02 (CAS 4B)    
1 42759U 17034B   19204.01804095  .00000029  00000-0  15314-4 0  9994
2 42759  43.0201  42.2492 0009950 106.2661  24.7105 15.09600835116023
NUSAT-3 (MILANESAT)     
1 42760U 17034C   19204.02014115  .00000117  00000-0  20439-4 0  9995
2 42760  43.0189  42.1787 0008419 128.4104   3.1641 15.10034653116031
ZHUHAI-1 01 (CAS 4A)    
1 42761U 17034D   19204.04684873 -.00000100  00000-0  74311-5 0  9994
2 42761  43.0197  41.6059 0010391 108.4824  29.3823 15.09677161116022
CARTOSAT-2E             
1 42767U 17036C   19204.16358284  .00000298  00000-0  17379-4 0  9996
2 42767  97.4694 262.5790 0010070 104.0809 256.1545 15.19231179115383
FORMOSAT-5              
1 42920U 17049A   19204.09646159 -.00000037  00000-0  18200-5 0  9991
2 42920  98.3286 282.0019 0009488 262.0877  97.9244 14.50842624101113
SENTINEL-5P             
1 42969U 17064A   19203.89055814 -.00000023  00000-0  99566-5 0  9999
2 42969  98.7368 142.8634 0001081  87.8962 272.2338 14.19542275 91851
SKYSAT-C11              
1 42987U 17068A   19203.87542707  .00000260  00000-0  14503-4 0  9992
2 42987  97.4352 317.1133 0010334  96.3349 263.9064 15.21865709 95598
SKYSAT-C10              
1 42988U 17068B   19203.86196995  .00000261  00000-0  14533-4 0  9990
2 42988  97.4347 316.9952 0005525 113.2659 246.9159 15.21849931 95593
SKYSAT-C9               
1 42989U 17068C   19203.26063692  .00000266  00000-0  14720-4 0  9995
2 42989  97.4367 316.8714 0001850  97.0601 263.0845 15.21848409 95528
SKYSAT-C8               
1 42990U 17068D   19203.90887325  .00000260  00000-0  14521-4 0  9998
2 42990  97.4377 317.4080 0004988 137.2513 222.9112 15.21762249 95616
SKYSAT-C7               
1 42991U 17068E   19203.89777216  .00000266  00000-0  14799-4 0  9997
2 42991  97.4370 317.4068 0006658 148.8327 211.3305 15.21770565 95619
SKYSAT-C6               
1 42992U 17068F   19204.21496549  .00000278  00000-0  15305-4 0  9999
2 42992  97.4372 317.9175 0010722 210.0841 149.9780 15.21799801 95679
CARTOSAT-2F             
1 43111U 18004A   19204.21276730  .00000608  00000-0  32030-4 0  9993
2 43111  97.4316 265.1978 0005525 120.1958 292.9294 15.19258445 84578
MICROSAT-TD             
1 43128U 18004T   19204.13522513  .00012972  00000-0  10401-3 0  9999
2 43128  96.8027 259.6202 0007503 356.5759   3.5453 15.71105778 87415
NUSAT-4 (ADA)           
1 43195U 18015D   19204.18443582  .00000523  00000-0  24577-4 0  9997
2 43195  97.4003 331.2519 0017670 174.2975 307.8343 15.23813536 81584
NUSAT-5 (MARYAM)        
1 43204U 18015K   19204.15199280  .00000589  00000-0  27178-4 0  9990
2 43204  97.4006 331.3062 0017249 176.6490 308.5842 15.24014365 81184
GAOFEN 1-02             
1 43259U 18031A   19204.20125341  .00000041  00000-0  13216-4 0  9992
2 43259  97.9958 281.4890 0004880 157.7705 202.3731 14.76431018 70691
GAOFEN 1-03             
1 43260U 18031B   19204.17863666  .00000010  00000-0  88046-5 0  9999
2 43260  97.9956 281.4920 0003956 244.6427 115.4385 14.76428767 70680
GAOFEN 1-04             
1 43262U 18031D   19204.15596564  .00000041  00000-0  13229-4 0  9993
2 43262  97.9960 281.4097 0004033 168.2486 191.8834 14.76428643 70674
SENTINEL-3B             
1 43437U 18039A   19203.59924969 -.00000015  00000-0  11925-4 0  9999
2 43437  98.6279 270.0147 0001712  92.4423 267.6954 14.26736193 64562
GAOFEN 5                
1 43461U 18043A   19204.12365630 -.00000025  00000-0  43605-5 0  9997
2 43461  98.1645 141.7446 0002160  19.0021 341.1259 14.57761025 64173
GAOFEN 6                
1 43484U 18048A   19204.19134424  .00000027  00000-0  11296-4 0  9990
2 43484  98.0164 282.0710 0010257  25.3657 334.8082 14.76483732 61387
GAOFEN 11               
1 43585U 18063A   19204.18634979  .00000320  00000-0  16334-4 0  9992
2 43585  97.4122 283.4586 0016949 298.8251 116.5722 15.23570565 54958
AEOLUS                  
1 43600U 18066A   19203.98130545  .00014706  00000-0  58557-4 0  9996
2 43600  96.7193 210.3042 0002584  94.9308 319.7090 15.86730836 52962
ICESAT-2                
1 43613U 18070A   19203.88941989  .00000658  00000-0  23693-4 0  9990
2 43613  92.0037 332.3157 0003071 101.5623 258.5971 15.28261245 47401
HYSIS                   
1 43719U 18096A   19204.19127515  .00000070  00000-0  16695-4 0  9993
2 43719  97.9458 271.4265 0009708 209.4296 150.6378 14.78653024 34862
KAZSTSAT                
1 43783U 18099AB  19204.17353888 -.00000214  00000-0 -14899-4 0  9995
2 43783  97.7572 275.6147 0008324 193.6769 166.4226 14.93607353 34537
SAUDISAT 5A             
1 43831U 18102A   19204.18562270 -.00000473  00000-0 -26664-4 0  9992
2 43831  97.6025 279.4345 0013869 201.0628 243.0077 15.07897916 34362
SAUDISAT 5B             
1 43833U 18102C   19204.18576242 -.00000493  00000-0 -27618-4 0  9990
2 43833  97.6020 279.5808 0014605 210.5286 233.4866 15.08335337 34362
"
