\relax 
\providecommand\hyper@newdestlabel[2]{}
\providecommand\HyperFirstAtBeginDocument{\AtBeginDocument}
\HyperFirstAtBeginDocument{\ifx\hyper@anchor\@undefined
\global\let\oldcontentsline\contentsline
\gdef\contentsline#1#2#3#4{\oldcontentsline{#1}{#2}{#3}}
\global\let\oldnewlabel\newlabel
\gdef\newlabel#1#2{\newlabelxx{#1}#2}
\gdef\newlabelxx#1#2#3#4#5#6{\oldnewlabel{#1}{{#2}{#3}}}
\AtEndDocument{\ifx\hyper@anchor\@undefined
\let\contentsline\oldcontentsline
\let\newlabel\oldnewlabel
\fi}
\fi}
\global\let\hyper@last\relax 
\gdef\HyperFirstAtBeginDocument#1{#1}
\providecommand\HyField@AuxAddToFields[1]{}
\providecommand\HyField@AuxAddToCoFields[2]{}
\@writefile{toc}{\contentsline {section}{\numberline {1}Introduction}{1}{section.1}\protected@file@percent }
\@writefile{lof}{\contentsline {figure}{\numberline {1}{\ignorespaces Solution Explorer with SimuSCA opened\relax }}{1}{figure.caption.1}\protected@file@percent }
\providecommand*\caption@xref[2]{\@setref\relax\@undefined{#1}}
\newlabel{sol-exp-basic}{{1}{1}{Solution Explorer with SimuSCA opened\relax }{figure.caption.1}{}}
\@writefile{toc}{\contentsline {section}{\numberline {2}Update the setup file}{1}{section.2}\protected@file@percent }
\@writefile{toc}{\contentsline {subsection}{\numberline {2.1}First case}{1}{subsection.2.1}\protected@file@percent }
\@writefile{lof}{\contentsline {figure}{\numberline {2}{\ignorespaces How to rebuild\relax }}{2}{figure.caption.2}\protected@file@percent }
\newlabel{rebuild}{{2}{2}{How to rebuild\relax }{figure.caption.2}{}}
\@writefile{toc}{\contentsline {subsection}{\numberline {2.2}Second case}{2}{subsection.2.2}\protected@file@percent }
\newlabel{second case}{{2.2}{2}{Second case}{subsection.2.2}{}}
\@writefile{lof}{\contentsline {figure}{\numberline {3}{\ignorespaces Adding a file/folder\relax }}{2}{figure.caption.3}\protected@file@percent }
\newlabel{add-file}{{3}{2}{Adding a file/folder\relax }{figure.caption.3}{}}
\@writefile{toc}{\contentsline {section}{\numberline {3}Create a setup file from scratch }{2}{section.3}\protected@file@percent }
\newlabel{sec: create setup}{{3}{2}{Create a setup file from scratch}{section.3}{}}
\@writefile{lof}{\contentsline {figure}{\numberline {4}{\ignorespaces Creating a new setup project\relax }}{3}{figure.caption.4}\protected@file@percent }
\newlabel{new-project}{{4}{3}{Creating a new setup project\relax }{figure.caption.4}{}}
\@writefile{lof}{\contentsline {figure}{\numberline {5}{\ignorespaces step 1\relax }}{3}{figure.caption.5}\protected@file@percent }
\newlabel{step1}{{5}{3}{step 1\relax }{figure.caption.5}{}}
\@writefile{lof}{\contentsline {figure}{\numberline {6}{\ignorespaces step 2\relax }}{4}{figure.caption.6}\protected@file@percent }
\newlabel{step2}{{6}{4}{step 2\relax }{figure.caption.6}{}}
\@writefile{lof}{\contentsline {figure}{\numberline {7}{\ignorespaces step 3\relax }}{4}{figure.caption.7}\protected@file@percent }
\newlabel{step3}{{7}{4}{step 3\relax }{figure.caption.7}{}}
