"CALSPHERE 1             
1 00900U 64063C   19204.17664059  .00000170  00000-0  17275-3 0  9995
2 00900  90.1466  23.1334 0025929 333.6126 116.5214 13.73253316725125
CALSPHERE 2             
1 00902U 64063E   19203.95323163  .00000016  00000-0  10961-4 0  9995
2 00902  90.1546  25.6350 0017902 352.5233 160.9079 13.52674242515404
LCS 1                   
1 01361U 65034C   19203.83804056  .00000006  00000-0 -34597-3 0  9996
2 01361  32.1451  43.5310 0009184 333.0983  26.9038  9.89295896960183
TEMPSAT 1               
1 01512U 65065E   19203.51686155  .00000013  00000-0  67595-5 0  9994
2 01512  89.8553 230.3863 0071370 128.3224  25.5556 13.33420879623980
CALSPHERE 4(A)          
1 01520U 65065H   19203.87060978  .00000046  00000-0  72268-4 0  9999
2 01520  90.0528 127.7605 0071297  16.0520  68.5584 13.35792539626065
OPS 5712 (P/L 160)      
1 02826U 67053A   19203.87805164  .00000262  00000-0  85536-4 0  9994
2 02826  69.9273 252.3986 0005554  15.0433 345.0864 14.48767343699557
OPS 5712 (P/L 153)      
1 02874U 67053H   19204.18351241 -.00000014  00000-0  28537-4 0  9998
2 02874  69.9745 115.9959 0009507 239.2231 120.7939 13.96332556655308
SURCAL 150B             
1 02909U 67053J   19203.78590760  .00000343  00000-0  82914-4 0  9996
2 02909  69.9484 291.1591 0001757  99.9713 260.1625 14.61330687708565
RIGIDSPHERE 2 (LCS 4)   
1 05398U 71067E   19203.87466147  .00000132  00000-0  40526-4 0  9991
2 05398  87.6236 315.3665 0061055 282.9589  76.4795 14.33806918512276
"
