"OSCAR 7 (AO-7)          
1 07530U 74089B   22178.95403185 -.00000048  00000+0 -11249-4 0  9992
2 07530 101.9042 158.8572 0012481  23.5377  41.2685 12.53655584178784
PHASE 3B (AO-10)        
1 14129U 83058B   22177.01339713  .00000141  00000+0  00000+0 0  9991
2 14129  26.4320  94.9287 6003739  84.5516 336.8799  2.05866698265583
UOSAT 2 (UO-11)         
1 14781U 84021B   22178.90474149  .00000443  00000+0  59686-4 0  9992
2 14781  97.6173 165.8624 0006898 292.0469  68.0012 14.83692873 41598
LUSAT (LO-19)           
1 20442U 90005G   22178.85332195  .00000039  00000+0  30803-4 0  9991
2 20442  98.7943 143.8737 0012509 134.3242 225.8969 14.33066611694598
EYESAT A (AO-27)        
1 22825U 93061C   22179.07866403  .00000038  00000+0  32745-4 0  9998
2 22825  98.8857 210.3407 0008911  27.8773 332.2884 14.30177260499942
ITAMSAT (IO-26)         
1 22826U 93061D   22179.09930246  .00000050  00000+0  36960-4 0  9995
2 22826  98.8802 210.2403 0009184  14.6277 345.5169 14.30523494500180
RADIO ROSTO (RS-15)     
1 23439U 94085A   22178.95101319 -.00000039  00000+0  10000-3 0  9992
2 23439  64.8154 128.6361 0168154 270.7358  87.4300 11.27572694132670
JAS-2 (FO-29)           
1 24278U 96046B   22179.08020573 -.00000013  00000+0  25604-4 0  9999
2 24278  98.5152 201.3089 0349234 255.6993 100.5137 13.53116592277292
TECHSAT 1B (GO-32)      
1 25397U 98043D   22178.82962435  .00000003  00000+0  21041-4 0  9993
2 25397  98.8184 129.3254 0002406  82.5334 277.6117 14.23759056244901
ISS (ZARYA)             
1 25544U 98067A   22179.15745046  .00008743  00000+0  16246-3 0  9996
2 25544  51.6440 282.2566 0004569 305.8340 122.4968 15.49737794346887
PCSAT (NO-44)           
1 26931U 01043C   22179.00781281  .00000053  00000+0  51829-4 0  9993
2 26931  67.0520  31.1557 0007464 262.0220  98.0034 14.30711751 83072
SAUDISAT 1C (SO-50)     
1 27607U 02058C   22178.61899165  .00000319  00000+0  64422-4 0  9996
2 27607  64.5549 270.7934 0078971 292.4740  66.8014 14.76144791 49876
CUTE-1 (CO-55)          
1 27844U 03031E   22178.90728563  .00000147  00000+0  85458-4 0  9997
2 27844  98.6777 186.4355 0011109  74.0654 286.1748 14.22459339985359
CUBESAT XI-IV (CO-57)   
1 27848U 03031J   22178.94389079  .00000125  00000+0  76299-4 0  9999
2 27848  98.6822 186.9891 0011025  86.6405 273.6034 14.22015508985179
MOZHAYETS 4 (RS-22)     
1 27939U 03042A   22179.03546789  .00000454  00000+0  89021-4 0  9998
2 27939  98.1927 319.7536 0013189 169.0678 191.0796 14.67372034  2597
CUBESAT XI-V            
1 28895U 05043F   22178.90502643  .00000526  00000+0  10832-3 0  9992
2 28895  98.1081 310.1228 0017986 107.6833 252.6335 14.64362733888949
FALCONSAT-3             
1 30776U 07006E   22178.73328834  .00026052  00000+0  38824-3 0  9996
2 30776  35.4291 192.8936 0003691 199.9541 160.1047 15.54124329851182
CUTE-1.7+APD II (CO-65) 
1 32785U 08021C   22178.70782959  .00001076  00000+0  11813-3 0  9993
2 32785  97.6576 149.2315 0012088 192.6341 167.4576 14.89623078768013
DELFI-C3 (DO-64)        
1 32789U 08021G   22179.05802856  .00006688  00000+0  37125-3 0  9993
2 32789  97.3377 204.9736 0008037 289.2957  70.7406 15.14029679773632
SEEDS II (CO-66)        
1 32791U 08021J   22178.63223446  .00001670  00000+0  16689-3 0  9999
2 32791  97.6113 154.6411 0013490 148.9445 211.2574 14.92716804768718
YUBILEINY (RS-30)       
1 32953U 08025A   22179.08286360  .00000024  00000+0  10000-3 0  9990
2 32953  82.5027 177.3260 0018065 235.1947 124.7435 12.43111291639655
KKS-1 (KISEKI)          
1 33499U 09002H   22179.15668957  .00000421  00000+0  68931-4 0  9994
2 33499  98.2168  61.3797 0007666 284.0341  76.0015 14.76030912722254
SWISSCUBE               
1 35932U 09051B   22178.88428836  .00000386  00000+0  97043-4 0  9997
2 35932  98.5677  35.1129 0008084  24.5321 335.6259 14.56877372677614
BEESAT-1                
1 35933U 09051C   22178.83924410  .00000332  00000+0  85004-4 0  9997
2 35933  98.5618  36.6893 0006528  38.1612 322.0046 14.56891889677689
ITUPSAT1                
1 35935U 09051E   22179.13791284  .00000294  00000+0  77861-4 0  9993
2 35935  98.5719  37.0493 0008846  37.6380 322.5435 14.56000121677469
XIWANG-1 (HOPE-1)       
1 36122U 09072B   22179.13973435 -.00000065  00000+0 -56753-4 0  9990
2 36122 100.1830 150.1077 0007056 321.6024  38.4586 13.16369791602329
JUGNU                   
1 37839U 11058B   22179.13772692  .00000337  00000+0  37738-4 0  9997
2 37839  19.9609 110.6582 0018749 274.4000 112.3401 14.12789717553760
SRMSAT                  
1 37841U 11058D   22178.37081064  .00000330  00000+0  36043-4 0  9992
2 37841  19.9702 194.9721 0012059  92.9586 295.1089 14.10757909552641
M-CUBED & EXP-1 PRIME   
1 37855U 11061F   22178.89019056  .00005623  00000+0  24901-3 0  9999
2 37855 101.7106 303.4875 0152658  31.0888 329.9251 15.12571071582816
STRAND-1                
1 39090U 13009E   22178.54680599  .00000108  00000+0  52766-4 0  9998
2 39090  98.4039  16.4198 0007950 237.4980 122.5438 14.35297076488840
SOMP                    
1 39134U 13015E   22178.90009037  .00007616  00000+0  27386-3 0  9996
2 39134  64.8625  27.6015 0035014 277.8510  81.8648 15.28761765508452
BEESAT-3                
1 39135U 13015F   22178.95689595  .00005856  00000+0  24400-3 0  9993
2 39135  64.8669  63.7127 0037930 284.8730  74.8200 15.24059971507716
BEESAT-2                
1 39136U 13015G   22178.94610489  .00005662  00000+0  24680-3 0  9994
2 39136  64.8757  71.9609 0016927 295.8411  64.0972 15.23072768507515
ZACUBE-1 (TSHEPISOSAT)  
1 39417U 13066B   22179.16753938  .00001298  00000+0  16397-3 0  9991
2 39417  97.6367 150.1805 0058171  11.2149 349.0346 14.82378780464713
GOMX-1                  
1 39430U 13066Q   22175.71835090  .00001690  00000+0  30809-3 0  9993
2 39430  97.8095  82.5020 0150085  22.5380 338.2325 14.60209619457353
CUBEBUG-2 (LO-74)       
1 39440U 13066AA  22178.88846145  .00001041  00000+0  14700-3 0  9990
2 39440  97.7266 136.0066 0080313  97.4028 263.6318 14.77029674461823
FUNCUBE-1 (AO-73)       
1 39444U 13066AE  22178.90659157  .00001615  00000+0  19739-3 0  9996
2 39444  97.6246 152.3379 0056696   0.3408 359.7836 14.83469664463079
UWE-3                   
1 39446U 13066AG  22179.16278018  .00001217  00000+0  16260-3 0  9994
2 39446  97.6860 142.7630 0070085  55.1532 305.6244 14.79595399462634
SPROUT                  
1 39770U 14029E   22179.25430973  .00004796  00000+0  49034-3 0  9994
2 39770  97.9435 296.2591 0009422  59.6126 300.5963 14.91007902439279
UNISAT-6                
1 40012U 14033C   22178.76397327  .00000966  00000+0  14700-3 0  9997
2 40012  97.6616   6.1766 0058715 124.8631 235.8119 14.74931010431503
DUCHIFAT-1              
1 40021U 14033M   22179.13118477  .00002168  00000+0  21446-3 0  9997
2 40021  98.0127 129.5259 0012859  13.1637 346.9915 14.92929791436299
QB50P1                  
1 40025U 14033R   22178.79688076  .00001517  00000+0  16096-3 0  9991
2 40025  97.9609 116.2766 0013042  29.5905 330.6048 14.90539773435309
NUDT-PHONESAT           
1 40900U 15049B   22178.99913081  .00021324  00000+0  60087-3 0  9997
2 40900  97.3994 197.0337 0007016 237.6912 178.4694 15.36433854376232
ZDPS 2A                 
1 40901U 15049C   22179.00311591  .00006327  00000+0  26197-3 0  9999
2 40901  97.4577 187.7479 0010004 315.7130  44.3306 15.24242409375067
ZDPS 2B                 
1 40902U 15049D   22179.04260332  .00009345  00000+0  38293-3 0  9993
2 40902  97.4665 185.4702 0010057 313.7118 131.1268 15.24454830375045
XW-2A                   
1 40903U 15049E   22179.08452582  .00019165  00000+0  29779-3 0  9998
2 40903  97.1791 237.6340 0011209  85.7252 333.6992 15.53917423380915
KAITUO 1A               
1 40904U 15049F   22179.04884900  .00003420  00000+0  17131-3 0  9994
2 40904  97.4943 181.4625 0013283 341.8148 102.0668 15.17988771374470
2015-049G               
1 40905U 15049G   22179.06602593  .00002797  00000+0  14644-3 0  9995
2 40905  97.5135 178.6675 0014622 343.4773  87.1726 15.16572475374228
XW-2C                   
1 40906U 15049H   22179.06679628  .00004424  00000+0  21318-3 0  9994
2 40906  97.4918 182.3945 0012901 329.6608 101.7945 15.19184352374536
XW-2D                   
1 40907U 15049J   22179.08543294  .00004946  00000+0  23351-3 0  9994
2 40907  97.4909 182.4024 0011929 324.7555 106.9146 15.19847329374587
LILACSAT-2              
1 40908U 15049K   22179.04945398  .00002635  00000+0  14096-3 0  9991
2 40908  97.5156 179.5266 0014909 347.0112  85.2979 15.15856675374095
XW-2E                   
1 40909U 15049L   22179.04045808  .00007646  00000+0  32089-3 0  9998
2 40909  97.4638 186.9050 0010074 303.0410 132.1523 15.23712614375029
XW-2F                   
1 40910U 15049M   22178.96904024  .00007603  00000+0  32401-3 0  9995
2 40910  97.4720 185.9711 0011146 303.7900 115.8676 15.23184520374786
XW-2B                   
1 40911U 15049N   22179.04636684  .00004952  00000+0  23456-3 0  9994
2 40911  97.4898 182.9609 0011891 326.3530 110.1411 15.19734091374462
KAITUO 1B               
1 40912U 15049P   22179.08485899  .00008616  00000+0  33436-3 0  9999
2 40912  97.4358 190.4356 0010617 263.9374 168.0747 15.26298598375374
TIANWANG 1A (TW-1A)     
1 40928U 15051D   22179.25650556  .00037624  00000+0  45458-3 0  9990
2 40928  97.0377 201.8182 0006002   8.1816  56.2097 15.60617696379928
LAPAN-A2                
1 40931U 15052B   22178.10803693  .00000998  00000+0  49621-4 0  9991
2 40931   5.9981 100.2018 0013470 308.6498  51.2560 14.76823231364779
E-ST@R-II               
1 41459U 16025D   22179.19909073  .00008628  00000+0  37477-3 0  9990
2 41459  98.1855 345.1482 0144189 232.4975 126.3143 15.13606033339123
AAUSAT 4                
1 41460U 16025E   22179.20833365  .00016833  00000+0  64228-3 0  9995
2 41460  98.1782 351.4535 0125057 208.1244 151.3378 15.19662860339578
NUSAT-1 (FRESCO)        
1 41557U 16033B   22179.20290774  .00009947  00000+0  29546-3 0  9994
2 41557  97.3887 276.9188 0009928 347.3299 100.0546 15.34933759339035
BEESAT-4                
1 41619U 16040W   22179.09390459  .00008844  00000+0  29352-3 0  9999
2 41619  97.2161 229.4399 0011235  83.5925 276.6596 15.31401391322355
CAS-2T & KS-1Q          
1 41847U 16066G   22178.91521336  .00000692  00000+0  11343-3 0  9994
2 41847  98.5506 243.5760 0363923 178.4119 181.8320 14.38600562295850
NAYIF-1 (EO-88)         
1 42017U 17008BX  22178.93090685  .00010061  00000+0  29904-3 0  9994
2 42017  97.2688 244.8938 0005053 186.4715 173.6464 15.34939039298689
ZHUHAI-1 02 (CAS-4B)    
1 42759U 17034B   22179.14461037  .00003032  00000+0  18625-3 0  9991
2 42759  43.0180 273.7666 0009698 348.9250  86.2725 15.11990280277973
ZHUHAI-1 01 (CAS-4A)    
1 42761U 17034D   22179.11198582  .00003040  00000+0  18626-3 0  9993
2 42761  43.0180 272.7284 0009842 349.9442  76.0315 15.12077013277979
MAX VALIER SAT          
1 42778U 17036P   22179.06981736  .00005162  00000+0  19633-3 0  9994
2 42778  97.2040 219.8065 0008738 290.8962  69.1342 15.27163823278522
RADFXSAT (FOX-1B)       
1 43017U 17073E   22178.70634351  .00002285  00000+0  17481-3 0  9992
2 43017  97.6749  72.4816 0249106 153.9576 207.4423 14.81447043248636
FOX-1D (AO-92)          
1 43137U 18004AC  22179.15203095  .00005667  00000+0  20024-3 0  9991
2 43137  97.3689 254.2125 0006424 334.4797  25.6125 15.29580469247975
DIWATA-2B               
1 43678U 18084H   22179.11159468  .00000262  00000+0  31533-4 0  9993
2 43678  97.9719 312.5024 0008503 247.3912 112.6410 14.92184013199448
ES'HAIL 2               
1 43700U 18090A   22177.98167764  .00000153  00000+0  00000+0 0  9996
2 43700   0.0190  68.0488 0001017  54.8146 171.4153  1.00274592 13126
FOX-1CLIFF (AO-95)      
1 43770U 18099N   22179.15511104  .00001122  00000+0  10368-3 0  9993
2 43770  97.6208 245.2276 0012767 236.2954 123.7051 14.96484138194615
ITASAT 1                
1 43786U 18099AE  22178.74622718  .00001745  00000+0  15790-3 0  9993
2 43786  97.6237 245.7533 0013458 229.2454 130.7600 14.96625263194591
JY1SAT (JO-97)          
1 43803U 18099AX  22178.69373118  .00001166  00000+0  10581-3 0  9994
2 43803  97.6197 245.4606 0013478 229.4846 130.5203 14.97127836194606
UWE-4                   
1 43880U 18111E   22179.02005856  .00002402  00000+0  20710-3 0  9992
2 43880  97.6684  85.1463 0009666 287.9972  72.0196 14.98211459189280
NEXUS (FO-99)           
1 43937U 19003F   22179.08570680  .00007463  00000+0  25030-3 0  9996
2 43937  97.1292 212.0232 0022547 114.6948 245.6645 15.30923054191604
PSAT2 (NO-104)          
1 44354U 19036R   22179.09091439  .00054720 -52307-5  47353-3 0  9991
2 44354  28.5237 104.5387 0225357  90.6306 272.0119 15.41181545166319
JAISAT-1                
1 44419U 19038F   22179.18583280  .00004873  00000+0  24548-3 0  9996
2 44419  97.6357 149.3955 0021350  94.1978 266.1695 15.17465465164680
DUCHIFAT-3              
1 44854U 19089C   22178.81672985  .00002851  00000+0  22418-3 0  9993
2 44854  36.9671  38.9051 0009850 306.6822  53.2984 15.01143381139498
CAS-6 (TO-108)          
1 44881U 19093C   22179.18074326  .00000477  00000+0  67070-4 0  9990
2 44881  97.8927 258.2350 0015773 146.7446 213.4770 14.81740280136367
RS-44 & BREEZE-KM R/B   
1 44909U 19096E   22178.82340676  .00000034  00000+0  10014-3 0  9992
2 44909  82.5207 223.3863 0216272 295.6372  62.2527 12.79713621116835
ORBITAL FACTORY 2 (OF-2)
1 45113U 19071C   22178.71289917  .00018156  00000+0  37432-3 0  9998
2 45113  51.6393   8.8708 0009846 206.8213 153.2266 15.45906484134967
HUSKYSAT-1 (HO-107)     
1 45119U 19071J   22178.78962762  .00017294  00000+0  36901-3 0  9999
2 45119  51.6395   8.6070 0009677 203.4993 156.5553 15.44934212134969
BY70-2                  
1 45857U 20042B   22179.17705300  .00005814  00000+0  77536-3 0  9999
2 45857  97.9546 255.9139 0012294  85.9221 274.3366 14.79937477107041
SALSAT                  
1 46495U 20068K   22178.80431941  .00000974  00000+0  73827-4 0  9994
2 46495  97.7294 120.1079 0015030 240.3370 119.6360 15.04547955 95742
BY70-3                  
1 46839U 20079N   22179.14086564  .00017296  00000+0  40166-3 0  9997
2 46839  97.1984 251.0967 0003645 290.3293 125.8957 15.42417020 91896
RADFXSAT-2 (AO-109)     
1 47311U 21002C   22178.75964735  .00005533  00000+0  22704-3 0  9990
2 47311  60.6857 323.4449 0018040 344.7235  15.3306 15.25445163 80035
UVSQ-SAT                
1 47438U 21006AB  22178.71060410  .00004723  00000+0  25042-3 0  9995
2 47438  97.4369 237.5103 0010624 233.7025 126.3227 15.15801745 78838
DIY-1 (ARDUIQUBE)       
1 47963U 21022AH  22178.98977619  .00008866  00000+0  49287-3 0  9992
2 47963  97.5325  80.2282 0019315  94.9388 265.4049 15.13762431 68540
XW-3 (CAS-9)            
1 50466U 21131B   22179.16209299  .00000085  00000+0  42412-4 0  9997
2 50466  98.5805 256.4110 0005896 114.1739 246.0065 14.38504095 26450
TEVEL-3                 
1 50988U 22002E   22179.12948949  .00005746  00000+0  31482-3 0  9995
2 50988  97.4814 245.9332 0010405  36.4390  20.4801 15.14546355 25032
TEVEL-8                 
1 50989U 22002F   22179.13453647  .00005655  00000+0  31039-3 0  9990
2 50989  97.4830 245.9564 0010420  35.5072  19.0955 15.14494185 25039
TEVEL-5                 
1 50998U 22002Q   22179.14677213  .00005773  00000+0  31199-3 0  9996
2 50998  97.4806 246.0462 0011621  31.2215  24.8302 15.15023790 25049
TEVEL-6                 
1 50999U 22002R   22179.07843030  .00005819  00000+0  31442-3 0  9993
2 50999  97.4806 245.9768 0011769  30.7686  14.8029 15.15027685 25037
TEVEL-1                 
1 51013U 22002AF  22179.13437221  .00005684  00000+0  31174-3 0  9991
2 51013  97.4804 245.9213 0010245  36.1275  34.4885 15.14522041 25033
TEVEL-7                 
1 51062U 22002CG  22179.13617674  .00005657  00000+0  31057-3 0  9997
2 51062  97.4822 245.9482 0010276  35.0371  21.0606 15.14484270 25038
TEVEL-4                 
1 51063U 22002CH  22179.13726328  .00005641  00000+0  30977-3 0  9998
2 51063  97.4822 245.9463 0010257  35.4722  23.7103 15.14476372 25036
TEVEL-2                 
1 51069U 22002CP  22179.13065201  .00005763  00000+0  31585-3 0  9991
2 51069  97.4808 245.9235 0010260  36.6392  20.8767 15.14538922 25037
"
