{
	    "BodyMass_min": 0.1,
        "BodyMass_max": 100,
        "BodyHeigth_min": 0.4, 
        "BodyHeigth_max": 10, 
        "BodyWidth_min": 0.4,
        "BodyWidth_max": 10,
        "BodyInertia_min": 0,
        "BodyInertia_max": 100,
        "BoomMass_min": 0,
        "BoomMass_max": 50,
        "BoomDist_min": 0.4,
        "BoomDist_max": 10,
		"PanelMass_min": 0.1,
        "PanelMass_max": 50,
        "PanelStrings_min": 1,
        "PanelStrings_max":  50,
        "PanelLength_min": 0.1,
        "PanelLength_max": 20,
        "PanelWidth_min": 0.1,
        "PanelWidth_max": 20,
		"dipsat_passive_min": -10,
        "dipsat_passive_max": 10,
		"dipsat_active_min": -10,
        "dipsat_active_max": 10,
		"JR_min": 0,
        "JR_max": 50,
        "om_min": 0,
        "om_max": 1000,
		"DampersMass_min": 0,
        "DampersMass_max": 20,
        "DampersDist_min": 0, 
        "DampersDist_max": 10,
        "c_min": 0,
        "c_max": 100000,
        "kd_min": 0,
        "kd_max": 100000,
		"jet_min": -10,
        "jet_max": 10
}
