"TDRS 3                  
1 19548U 88091B   22151.25266183 -.00000299  00000+0  00000+0 0  9996
2 19548  13.7275 351.4580 0035217 335.4213 323.6790  1.00264606110545
HST                     
1 20580U 90037B   22151.72215373  .00001842  00000+0  98088-4 0  9996
2 20580  28.4705 279.6645 0002356 208.8265 288.0442 15.10532310563686
TDRS 5                  
1 21639U 91054B   22152.14475799  .00000086  00000+0  00000+0 0  9990
2 21639  14.2396   4.7805 0025878   2.1110 127.1513  1.00275845112890
TDRS 6                  
1 22314U 93003B   22151.17299559 -.00000295  00000+0  00000+0 0  9990
2 22314  14.1308   8.0268 0012154 107.8864 149.1630  1.00269434107586
TDRS 7                  
1 23613U 95035B   22151.67801830 -.00000200  00000+0  00000+0 0  9992
2 23613  13.9845 358.7109 0030420  50.9842 168.2344  1.00276557 98432
ISS (ZARYA)             
1 25544U 98067A   22152.21715789  .00009276  00000+0  17141-3 0  9992
2 25544  51.6445  55.6885 0004972 178.4448 316.7589 15.49809799342708
LANDSAT 7               
1 25682U 99020A   22152.18535967  .00000377  00000+0  88268-4 0  9991
2 25682  97.9797 200.8696 0001620  99.9675 260.1710 14.59747798230191
TERRA                   
1 25994U 99068A   22152.19328071  .00000243  00000+0  63719-4 0  9992
2 25994  98.1371 224.4860 0001444  94.7700 289.6303 14.57171679194256
TDRS 8                  
1 26388U 00034A   22151.75535303 -.00000232  00000+0  00000+0 0  9992
2 26388  10.3421  42.6742 0023195 346.8825 220.9700  1.00271999 80366
TIMED                   
1 26998U 01055B   22151.71080395  .00000610  00000+0  69419-4 0  9998
2 26998  74.0719 312.9978 0001567 231.2507 128.8535 14.88657608110515
TDRS 9                  
1 27389U 02011A   22151.29088663 -.00000283  00000+0  00000+0 0  9998
2 27389   8.9847  60.9783 0025336 305.4398 284.7611  1.00266947 75625
AQUA                    
1 27424U 02022A   22151.80116668  .00000433  00000+0  10579-3 0  9996
2 27424  98.2470  93.8501 0000968  65.2375 316.5397 14.57286067 67764
TDRS 10                 
1 27566U 02055A   22151.62295397  .00000093  00000+0  00000+0 0  9992
2 27566   8.1734  50.0683 0009451 342.3709 269.7245  1.00271996 71413
SORCE                   
1 27651U 03004A   22151.84261081  .00000938  00000+0  10949-3 0  9994
2 27651  39.9960 310.2397 0023561 352.9748   7.0708 14.89888003 50599
AURA                    
1 28376U 04026A   22151.87800282  .00000436  00000+0  10667-3 0  9999
2 28376  98.2088  95.4508 0001577  84.1809 275.9569 14.57140487950811
SWIFT                   
1 28485U 04047A   22151.87284246  .00002900  00000+0  16128-3 0  9995
2 28485  20.5574  66.7810 0010800  88.6114 271.5557 15.06344880961048
THEMIS A                
1 30580U 07004A   22151.13961307 -.00000146  00000+0  31272-1 0  9995
2 30580  14.6711 347.0654 8378999 162.1567 274.2609  0.87834758 52971
THEMIS D                
1 30797U 07004D   22151.57268914 -.00000163  00000+0  00000+0 0  9999
2 30797  10.5755 336.8177 8342753 175.5531  61.8250  0.87837550 28088
THEMIS E                
1 30798U 07004E   22151.57227385 -.00000166  00000+0  00000+0 0  9990
2 30798  11.2929 349.4189 8329133 165.1986  50.5132  0.87841060 52924
AIM                     
1 31304U 07015A   22151.51596999  .00006285  00000+0  31702-3 0  9994
2 31304  97.8571  70.0888 0006875  79.9721 280.2287 15.17495663828624
FGRST (GLAST)           
1 33053U 08029A   22151.60703671  .00001531  00000+0  69557-4 0  9999
2 33053  25.5826 282.0473 0011951 346.8311  13.1912 15.12163710771147
WISE                    
1 36119U 09071A   22152.01603903  .00005056  00000+0  15875-3 0  9995
2 36119  97.2400 186.7686 0002776  43.3143 316.8317 15.33456301693004
TDRS 11                 
1 39070U 13004A   22151.77618608  .00000090  00000+0  00000+0 0  9998
2 39070   2.9452 345.6066 0007316  69.1026 299.8582  1.00279917 31883
TDRS 12                 
1 39504U 14004A   22151.90877160 -.00000262  00000+0  00000+0 0  9998
2 39504   3.8741 347.0164 0005146 112.2461  76.3882  1.00269504 29466
GPM-CORE                
1 39574U 14009C   22151.61319713  .00014371  00000+0  20182-3 0  9995
2 39574  65.0028 245.6444 0011250 268.8481  91.1376 15.56884474468980
MMS 1                   
1 40482U 15011A   22139.84485279 -.00000394  00000+0  00000+0 0  9995
2 40482  32.4594 106.2871 8629753  50.5039  51.7441  0.28354801 13214
MMS 2                   
1 40483U 15011B   22140.55734069 -.00000366  00000+0  00000+0 0  9999
2 40483  32.5047 106.3488 8643182  50.4675 124.4788  0.28365196 13199
MMS 3                   
1 40484U 15011C   22143.54229317 -.00000085  00000+0  00000+0 0  9995
2 40484  32.5380 106.4625 8662556  50.6364  69.3646  0.28461674 12970
MMS 4                   
1 40485U 15011D   22140.55736656 -.00000366  00000+0  00000+0 0  9995
2 40485  32.5031 106.3514 8642363  50.4725 124.4608  0.28365211 13199
TDRS 13                 
1 42915U 17047A   22151.84563316 -.00000092  00000+0  00000+0 0  9997
2 42915   4.5009 333.3495 0019427 110.6931  98.1526  1.00272799 17539
JPSS-1                  
1 43013U 17073A   22152.01213342  .00000042  00000+0  40626-4 0  9994
2 43013  98.7163  90.8236 0001567  93.1995 266.9360 14.19554944234894
"
