"NOAA 15                 
1 25338U 98030A   22179.15421128  .00000121  00000+0  68830-4 0  9998
2 25338  98.6429 208.5496 0009152 265.7767  94.2367 14.26143508254794
DMSP 5D-3 F15 (USA 147) 
1 25991U 99067A   22178.92899163  .00000043  00000+0  44903-4 0  9994
2 25991  99.0520 170.6839 0010573 153.5062 268.6281 14.16547800165253
METEOSAT-8 (MSG-1)      
1 27509U 02040B   22178.77406015  .00000137  00000+0  00000+0 0  9998
2 27509   8.0562  50.6084 0001197   5.2537 180.0428  1.00275936 72712
DMSP 5D-3 F16 (USA 172) 
1 28054U 03048A   22179.14734103 -.00000026  00000+0  10287-4 0  9998
2 28054  98.9878 170.0128 0006307 291.4370 159.8202 14.13675741964534
NOAA 18                 
1 28654U 05018A   22179.18384411  .00000129  00000+0  93785-4 0  9997
2 28654  98.9488 249.6113 0013223 303.3937  56.5969 14.12746680881587
METEOSAT-9 (MSG-2)      
1 28912U 05049B   22178.84662924  .00000131  00000+0  00000+0 0  9994
2 28912   6.0427  66.2484 0001574 350.8987 209.2016  1.00269955 60496
EWS-G1 (GOES 13)        
1 29155U 06018A   22178.84976909  .00000048  00000+0  00000+0 0  9999
2 29155   0.6271  96.9455 0003570  88.8740  97.2357  1.00270324 28831
DMSP 5D-3 F17 (USA 191) 
1 29522U 06050A   22179.11534511 -.00000024  00000+0  10178-4 0  9990
2 29522  98.7657 193.9708 0008912 226.7103 133.3327 14.14102542807418
FENGYUN 3A              
1 32958U 08026A   22179.18768727  .00000023  00000+0  31142-4 0  9999
2 32958  98.5030 141.3809 0008748   0.4436 359.6747 14.18724536729857
FENGYUN 2E              
1 33463U 08066A   22178.71126992 -.00000199  00000+0  00000+0 0  9994
2 33463   5.9291  65.2690 0002566  17.1370 175.7406  1.00280017 49544
NOAA 19                 
1 33591U 09005A   22179.11552946  .00000116  00000+0  87913-4 0  9998
2 33591  99.1467 213.4761 0014415 154.4922 205.6963 14.12581570689957
GOES 14                 
1 35491U 09033A   22178.60139601 -.00000082  00000+0  00000+0 0  9992
2 35491   0.3433  95.4130 0012637 116.5077 175.5757  1.00270714 47566
METEOR-M 1              
1 35865U 09049A   22179.15905552  .00000030  00000+0  32326-4 0  9994
2 35865  98.5285 149.2842 0002240 163.9583 196.1666 14.22341003663201
DMSP 5D-3 F18 (USA 210) 
1 35951U 09057A   22179.16398429  .00000154  00000+0  10475-3 0  9996
2 35951  98.7220 158.2862 0012226  59.6176 300.6204 14.13517308654623
GOES 15                 
1 36411U 10008A   22178.66846256  .00000065  00000+0  00000+0 0  9996
2 36411   0.3160 102.0593 0001926  14.7298 271.1210  1.00271199 45122
COMS 1                  
1 36744U 10032A   22178.86311347 -.00000337  00000+0  00000+0 0  9995
2 36744   1.0963  92.6549 0000659  11.6652 250.4806  1.00271170 36543
FENGYUN 3B              
1 37214U 10059A   22179.24678311  .00000041  00000+0  45492-4 0  9997
2 37214  99.0911 185.4115 0021698 327.6009  32.3825 14.14258616602487
SUOMI NPP               
1 37849U 11061A   22179.11520104  .00000013  00000+0  26737-4 0  9997
2 37849  98.7331 117.5194 0001067  86.6345 284.2805 14.19530657552707
FENGYUN 2F              
1 38049U 12002A   22178.78813050 -.00000353  00000+0  00000+0 0  9991
2 38049   3.8169  79.6352 0001948   8.8939 223.2103  1.00274290 38339
METEOSAT-10 (MSG-3)     
1 38552U 12035B   22178.83939983  .00000068  00000+0  00000+0 0  9998
2 38552   1.5370  41.7957 0000304 113.6524  71.8577  1.00274719 36312
METOP-B                 
1 38771U 12049A   22179.18564171  .00000049  00000+0  42507-4 0  9990
2 38771  98.6950 238.7795 0001653  70.4462 354.8697 14.21491948507258
FENGYUN 3C              
1 39260U 13052A   22179.22329485  .00000056  00000+0  49118-4 0  9994
2 39260  98.4528 206.7918 0009911 241.4306 118.5870 14.15928639453449
METEOR-M 2              
1 40069U 14037A   22179.16905575  .00000000  00000+0  19137-4 0  9997
2 40069  98.4305 196.4846 0004609 299.5386  60.5338 14.20711696413380
HIMAWARI-8              
1 40267U 14060A   22178.93734397 -.00000268  00000+0  00000+0 0  9990
2 40267   0.0221 279.3240 0000406 164.5843 310.2003  1.00265995 28325
FENGYUN 2G              
1 40367U 14090A   22179.07257647 -.00000291  00000+0  00000+0 0  9994
2 40367   1.9621  89.3887 0001427   9.7647 302.4050  1.00259690 27499
METEOSAT-11 (MSG-4)     
1 40732U 15034A   22178.90936082  .00000007  00000+0  00000+0 0  9991
2 40732   0.3086  58.3884 0001729  62.9288 122.2259  1.00279239 25480
ELEKTRO-L 2             
1 41105U 15074A   22178.90639542 -.00000110  00000+0  00000+0 0  9997
2 41105   3.0135  88.0165 0002005  46.6309  93.1372  1.00270905 23978
HIMAWARI-9              
1 41836U 16064A   22178.93734397 -.00000266  00000+0  00000+0 0  9997
2 41836   0.0169 342.6371 0000877 137.1454 274.4212  1.00272814 20765
GOES 16                 
1 41866U 16071A   22178.89435962 -.00000240  00000+0  00000+0 0  9991
2 41866   0.0608 237.2411 0000474 278.6857   6.8126  1.00272239 20561
FENGYUN 4A              
1 41882U 16077A   22178.93019208 -.00000322  00000+0  00000+0 0  9992
2 41882   0.0226 345.5751 0003423 146.8128 223.1264  1.00273954 20437
CYGFM05                 
1 41884U 16078A   22179.17366175  .00001601  00000+0  82022-4 0  9999
2 41884  34.9551 135.0635 0015347 190.6345 169.4043 15.16379113306514
CYGFM04                 
1 41885U 16078B   22179.15611831  .00001837  00000+0  92485-4 0  9995
2 41885  34.9485 124.3458 0014053 207.5643 152.4324 15.16909118306616
CYGFM02                 
1 41886U 16078C   22178.55428778  .00001825  00000+0  91778-4 0  9996
2 41886  34.9576 130.3082 0014586 196.3599 163.6643 15.16946289306443
CYGFM01                 
1 41887U 16078D   22178.91359262  .00001675  00000+0  86181-4 0  9993
2 41887  34.9517 139.0926 0015698 187.2382 172.8105 15.16185965306324
CYGFM08                 
1 41888U 16078E   22179.15817809  .00001617  00000+0  82235-4 0  9999
2 41888  34.9490 130.1696 0015145 201.6745 158.3327 15.16636265306523
CYGFM06                 
1 41889U 16078F   22179.19263261  .00001517  00000+0  76582-4 0  9998
2 41889  34.9571 125.0080 0013674 202.1864 157.8257 15.16962904306615
CYGFM07                 
1 41890U 16078G   22179.17746980  .00001667  00000+0  84145-4 0  9992
2 41890  34.9510 123.9413 0013543 206.2311 153.7716 15.16896088306618
CYGFM03                 
1 41891U 16078H   22178.18891696  .00002291  00000+0  11508-3 0  9994
2 41891  34.9538 130.5790 0012891 195.7610 164.2702 15.16886538306307
FENGYUN 3D              
1 43010U 17072A   22179.20947630  .00000037  00000+0  39086-4 0  9996
2 43010  98.8157 123.7550 0001034 193.9463 166.1684 14.19210632239290
NOAA 20                 
1 43013U 17073A   22179.14855027  .00000019  00000+0  29667-4 0  9995
2 43013  98.7170 117.5355 0001505  72.6227 287.5113 14.19559071238742
GOES 17                 
1 43226U 18022A   22178.09265142  .00000106  00000+0  00000+0 0  9994
2 43226   0.0819 252.4481 0000089 239.4954  39.3909  1.00272365 15876
FENGYUN 2H              
1 43491U 18050A   22178.85334503 -.00000122  00000+0  00000+0 0  9990
2 43491   1.1748  96.9616 0003967  35.9282 169.6105  1.00273449 14895
METOP-C                 
1 43689U 18087A   22179.13947217  .00000049  00000+0  42222-4 0  9997
2 43689  98.6832 238.9445 0003056  33.3690 326.7679 14.21492183188823
GEO-KOMPSAT-2A          
1 43823U 18100A   22178.93490187 -.00000335  00000+0  00000+0 0  9991
2 43823   0.0459 138.1027 0002207 308.4684 294.2650  1.00272184 13126
METEOR-M2 2             
1 44387U 19038A   22179.18565589  .00000017  00000+0  26768-4 0  9995
2 44387  98.7231 139.8787 0000350 182.0777 178.0403 14.23713202154931
FENGYUN 3E              
1 49008U 21062A   22179.15455732 -.00000010  00000+0  16064-4 0  9997
2 49008  98.7098 180.9439 0001504 359.1569   0.9603 14.19733444 50830
GOES 18                 
1 51850U 22021A   22178.73856921  .00000105  00000+0  00000+0 0  9991
2 51850   0.0552 118.8991 0002627 103.6748 182.3182  1.00271125  1236
"
