\relax 
\@writefile{toc}{\contentsline {section}{Index}{1}\protected@file@percent }
\@writefile{toc}{\contentsline {section}{\numberline {1}Introduction}{2}\protected@file@percent }
\@writefile{toc}{\contentsline {section}{\numberline {2}Creating a satellite}{2}\protected@file@percent }
\@writefile{toc}{\contentsline {subsection}{\numberline {2.1}Start defining our satellite}{2}\protected@file@percent }
\@writefile{toc}{\contentsline {subsection}{\numberline {2.2}Create the solar panels}{2}\protected@file@percent }
\@writefile{lof}{\contentsline {figure}{\numberline {1}{\ignorespaces Solar panel created\relax }}{3}\protected@file@percent }
\providecommand*\caption@xref[2]{\@setref\relax\@undefined{#1}}
\newlabel{sol-pan}{{1}{3}}
\@writefile{toc}{\contentsline {subsection}{\numberline {2.3}Create a gravity gradient boom}{3}\protected@file@percent }
\@writefile{toc}{\contentsline {section}{\numberline {3}Creating the orbit}{3}\protected@file@percent }
\@writefile{lof}{\contentsline {figure}{\numberline {2}{\ignorespaces ISS orbit\relax }}{4}\protected@file@percent }
\newlabel{iss-orbit}{{2}{4}}
\@writefile{toc}{\contentsline {section}{\numberline {4}Simulation and output data}{4}\protected@file@percent }
\@writefile{toc}{\contentsline {subsection}{\numberline {4.1}Simulation}{4}\protected@file@percent }
\@writefile{toc}{\contentsline {subsection}{\numberline {4.2}Output data (Attitude analysis)}{5}\protected@file@percent }
\@writefile{toc}{\contentsline {subsection}{\numberline {4.3}Check the results}{5}\protected@file@percent }
\@writefile{lof}{\contentsline {figure}{\numberline {3}{\ignorespaces Curves: Attitude control example\relax }}{6}\protected@file@percent }
\newlabel{torque-wd}{{3}{6}}
\@writefile{toc}{\contentsline {section}{\numberline {5}A little thermal analysis}{6}\protected@file@percent }
\@writefile{lof}{\contentsline {figure}{\numberline {4}{\ignorespaces Thermal data filled in\relax }}{6}\protected@file@percent }
\newlabel{therm-dat}{{4}{6}}
\@writefile{lof}{\contentsline {figure}{\numberline {5}{\ignorespaces Curves: Energy example\relax }}{7}\protected@file@percent }
\newlabel{curves-ther}{{5}{7}}
