"DMSP 5D-2 F14 (USA 131) 
1 24753U 97012A   19203.94168717  .00000057  00000-0  52390-4 0  9993
2 24753  99.0307 211.3060 0009760  65.4146 294.8043 14.15854908151442
NOAA 15                 
1 25338U 98030A   19203.94001037  .00000050  00000-0  39692-4 0  9998
2 25338  98.7451 225.1427 0011229 138.8885 221.3143 14.25922636101879
DMSP 5D-3 F15 (USA 147) 
1 25991U 99067A   19203.93822373 -.00000103  00000-0 -29235-4 0  9990
2 25991  98.9203 168.6551 0009398 327.1342 101.2715 14.16522603 13632
METEOSAT-8 (MSG-1)      
1 27509U 02040B   19204.21711740  .00000137  00000-0  00000+0 0  9998
2 27509   6.1497  55.4548 0000290 109.2910 255.6019  1.00265720 61970
DMSP 5D-3 F16 (USA 172) 
1 28054U 03048A   19203.91040231 -.00000108  00000-0 -33740-4 0  9991
2 28054  98.8682 179.8696 0008664  80.8940 307.4365 14.13683135813084
NOAA 18                 
1 28654U 05018A   19203.85136110  .00000076  00000-0  66254-4 0  9999
2 28654  99.0932 251.3287 0015353  82.9112 277.3804 14.12439539730245
METEOSAT-9 (MSG-2)      
1 28912U 05049B   19203.84212326  .00000016  00000-0  00000-0 0  9990
2 28912   3.7324  71.1715 0001929  47.5345 128.0645  1.00269261 49752
HIMAWARI-7 (MTSAT-2)    
1 28937U 06004A   19204.15758122 -.00000242  00000-0  00000+0 0  9994
2 28937   0.0815 274.7244 0003732 210.0732  17.5581  1.00271096 49078
FORMOSAT-3 FM6          
1 29047U 06011A   19203.92766646  .00000037  00000-0  30797-4 0  9991
2 29047  71.9789  64.5789 0051713 271.8816  87.6398 14.28686645694116
FORMOSAT-3 FM1          
1 29048U 06011B   19203.86777420  .00000110  00000-0  59594-4 0  9995
2 29048  71.9677 335.9966 0044907 230.5987 129.1170 14.28641331696590
FORMOSAT-3 FM5          
1 29049U 06011C   19203.25737416  .00000049  00000-0  35824-4 0  9991
2 29049  72.0204 147.0126 0036825 260.6781  99.0191 14.28727922692297
FORMOSAT-3 FM3          
1 29050U 06011D   19203.83962084  .00000115  00000-0  34659-4 0  9997
2 29050  72.0169 325.6825 0050609 207.4552 152.3926 14.58814952708111
FORMOSAT-3 FM4          
1 29051U 06011E   19203.75442930  .00000012  00000-0  20312-4 0  9999
2 29051  72.0054  48.6814 0067346 137.5995 223.0374 14.28755418694952
FORMOSAT-3 FM2          
1 29052U 06011F   19204.12729867  .00000054  00000-0  37506-4 0  9998
2 29052  72.0350 121.1425 0041306 220.6889 139.1161 14.28853560693330
GOES 13                 
1 29155U 06018A   19203.72341174 -.00000183  00000-0  00000-0 0  9994
2 29155   0.1232 287.0685 0006454 316.3615 234.8607  0.99976482 18094
METOP-A                 
1 29499U 06044A   19203.90280418 -.00000015  00000-0  12652-4 0  9991
2 29499  98.5718 256.1171 0001949 104.3049  10.6270 14.21488229661741
DMSP 5D-3 F17 (USA 191) 
1 29522U 06050A   19203.89342663 -.00000094  00000-0 -26189-4 0  9992
2 29522  98.8194 219.9464 0010840  42.3543 317.8465 14.14000062655996
FENGYUN 3A              
1 32958U 08026A   19204.19541180 -.00000015  00000-0  12290-4 0  9993
2 32958  98.3803 202.5423 0008044 209.2926 150.7804 14.18605014578009
FENGYUN 2E              
1 33463U 08066A   19204.07408350 -.00000203  00000-0  00000+0 0  9997
2 33463   3.6662  69.2002 0003605 261.8503  82.5918  1.00279347 38807
NOAA 19                 
1 33591U 09005A   19203.90600992  .00000077  00000-0  67087-4 0  9991
2 33591  99.1808 195.8592 0012934 283.9618  76.0115 14.12366456538478
GOES 14                 
1 35491U 09033A   19203.73452265 -.00000091  00000-0  00000-0 0  9997
2 35491   0.3493 101.7642 0008419 113.7167 244.3815  1.00273588 36844
METEOR-M 1              
1 35865U 09049A   19204.00150858  .00000006  00000-0  21198-4 0  9993
2 35865  98.4127 200.6055 0003591  79.5918 280.5665 14.22201552510951
DMSP 5D-3 F18 (USA 210) 
1 35951U 09057A   19203.90366551  .00000073  00000-0  61378-4 0  9993
2 35951  98.6206 200.3802 0010062 228.0332 131.9984 14.13209143276996
GOES 15                 
1 36411U 10008A   19203.74686383  .00000054  00000-0  00000-0 0  9993
2 36411   0.2818  99.8750 0001955   7.4147 333.7474  1.00264448 34385
COMS 1                  
1 36744U 10032A   19203.87896817 -.00000345  00000-0  00000-0 0  9992
2 36744   0.0300 100.6954 0001022  34.3859 249.8313  1.00271901 25807
FENGYUN 3B              
1 37214U 10059A   19204.20601416 -.00000021  00000-0  12560-4 0  9990
2 37214  99.0025 176.6249 0017709 121.7240 238.5661 14.15919497450943
SUOMI NPP               
1 37849U 11061A   19204.19751082  .00000003  00000-0  22228-4 0  9992
2 37849  98.7366 141.9257 0001493  97.9851  39.8165 14.19545517400768
FENGYUN 2F              
1 38049U 12002A   19203.84563494 -.00000359  00000-0  00000-0 0  9995
2 38049   1.3173  82.6605 0000821 172.0804 102.0947  1.00280396 27608
METEOSAT-10 (MSG-3)     
1 38552U 12035B   19203.84343181  .00000065  00000-0  00000-0 0  9992
2 38552   1.0466  26.4517 0001221 161.9119  65.2658  1.00281991 25607
METOP-B                 
1 38771U 12049A   19204.15409696 -.00000015  00000-0  13222-4 0  9999
2 38771  98.7008 262.9988 0001058 148.9386 265.5041 14.21492892355094
FENGYUN 3C              
1 39260U 13052A   19204.17993937 -.00000019  00000-0  11711-4 0  9991
2 39260  98.6007 261.8749 0012320  85.9204 274.3378 14.15869633301885
METEOR-M 2              
1 40069U 14037A   19204.15941776 -.00000010  00000-0  15006-4 0  9998
2 40069  98.5483 248.3575 0006112 150.7442 209.4088 14.20663418261314
HIMAWARI-8              
1 40267U 14060A   19203.94131047 -.00000276  00000-0  00000+0 0  9999
2 40267   0.0060 228.8500 0001311 291.7888 259.2700  1.00273745 17586
FENGYUN 2G              
1 40367U 14090A   19203.93311029 -.00000303  00000-0  00000-0 0  9994
2 40367   1.3146 100.2313 0000895 264.4093  11.1881  1.00275364 16754
METEOSAT-11 (MSG-4)     
1 40732U 15034A   19203.84142537 -.00000004  00000-0  00000-0 0  9993
2 40732   0.9753 256.3252 0002378 230.3164 116.4252  1.00269984 14753
ELEKTRO-L 2             
1 41105U 15074A   19204.08301141 -.00000097  00000-0  00000+0 0  9998
2 41105   0.4285 106.2087 0001864 354.4591 305.7427  1.00273437 13241
HIMAWARI-9              
1 41836U 16064A   19203.86951535 -.00000276  00000-0  00000-0 0  9992
2 41836   0.0462 292.5967 0000427 190.9946 270.5002  1.00270107  9909
GOES 16                 
1 41866U 16071A   19203.82650806 -.00000248  00000-0  00000-0 0  9995
2 41866   0.0136 102.2861 0000431  74.7178 345.6202  1.00268760  9831
FENGYUN 4A              
1 41882U 16077A   19203.93415713 -.00000331  00000-0  00000-0 0  9990
2 41882   0.0330  46.2150 0002860 100.3143 234.7978  1.00276614  9700
CYGFM05                 
1 41884U 16078A   19203.70021618  .00000159  00000-0  10233-4 0  9995
2 41884  34.9572 314.1685 0016450 330.3437  29.6340 15.14413823143930
CYGFM04                 
1 41885U 16078B   19203.71577722  .00000148  00000-0  95064-5 0  9993
2 41885  34.9503 309.0467 0014681 337.1747  22.8311 15.14921950143982
CYGFM02                 
1 41886U 16078C   19203.70884117  .00000157  00000-0  99963-5 0  9994
2 41886  34.9595 310.5961 0015501 334.2751  25.7189 15.14924490143971
CYGFM01                 
1 41887U 16078D   19203.69420195  .00000142  00000-0  93534-5 0  9997
2 41887  34.9540 314.8376 0016886 331.4510  28.5276 15.14231698143922
CYGFM08                 
1 41888U 16078E   19203.71029708  .00000162  00000-0  10285-4 0  9999
2 41888  34.9509 311.9006 0015996 335.9547  24.0416 15.14640682143942
CYGFM06                 
1 41889U 16078F   19203.68596076  .00000169  00000-0  10594-4 0  9993
2 41889  34.9589 309.4151 0014431 333.8251  26.1730 15.14914497143979
CYGFM07                 
1 41890U 16078G   19203.73023044  .00000146  00000-0  94013-5 0  9995
2 41890  34.9527 308.3872 0014149 336.5480  23.4585 15.14913767143989
CYGFM03                 
1 41891U 16078H   19203.72510737  .00000143  00000-0  92543-5 0  9998
2 41891  34.9559 308.5757 0013643 335.5812  24.4252 15.14913791143984
FENGYUN 3D              
1 43010U 17072A   19204.11994970 -.00000029  00000-0  70731-5 0  9996
2 43010  98.7157 142.8764 0001054 352.8652   7.2507 14.19723534 87320
NOAA 20                 
1 43013U 17073A   19203.85293560 -.00000005  00000-0  18135-4 0  9990
2 43013  98.7212 141.4933 0001121 105.6064 254.5236 14.19559079 86757
GOES 17                 
1 43226U 18022A   19203.78799259  .00000097  00000-0  00000-0 0  9997
2 43226   0.0201 115.5978 0000871   2.6641 328.4447  1.00272111  5128
FENGYUN 2H              
1 43491U 18050A   19204.07260049 -.00000126  00000-0  00000+0 0  9998
2 43491   1.4290 281.2175 0003209 235.5911 248.8583  1.00274819  4234
METOP-C                 
1 43689U 18087A   19203.83852723 -.00000044  00000-0  00000-0 0  9996
2 43689  98.7018 263.0015 0001836 198.6868 161.4243 14.21491060 36622
GEO-KOMPSAT-2A          
1 43823U 18100A   19203.87896817 -.00000344  00000-0  00000-0 0  9991
2 43823   0.0376 198.6825 0002094 262.1731 284.1499  1.00272200  2333
METEOR-M2 2             
1 44387U 19038A   19204.15341187 -.00000023  00000-0  87819-5 0  9997
2 44387  98.5698 166.7443 0002581  55.5148 304.6274 14.23333122  2549
"
