"GOES 1 (SMS-C) [-]      
1 08366U 75100A   17167.12774774 -.00000239  00000-0  00000-0 0  9992
2 08366  12.0499 318.5390 0004134 274.5047 356.9607  1.00273524152233
GOES 2 [-]              
1 10061U 77048A   17170.01377154  .00000084  00000-0  00000-0 0  9990
2 10061  13.2766 327.5565 0015509 318.4974  34.3150  0.99395292 90850
GOES 3 [-]              
1 10953U 78062A   17169.77945453 -.00000313  00000-0  00000-0 0  9997
2 10953  13.4221 331.1346 0002205 289.6181  76.7571  0.99364975 95951
GOES 4 [-]              
1 11964U 80074A   17170.18765267 -.00000198  00000-0  00000-0 0  9997
2 11964  14.1941 334.8659 0032279  13.0751 343.4235  0.99233394 95034
GOES 5 [-]              
1 12472U 81049A   17170.27392410 -.00000296  00000-0  00000-0 0  9990
2 12472  14.3677 345.0517 0003951 246.2667  68.3370  1.00267702 90025
GOES 6 [-]              
1 14050U 83041A   17169.44726101 -.00000273  00000-0  00000-0 0  9998
2 14050  14.5906 349.9285 0001911 203.1002 160.0517  1.00274702183114
GOES 7 [-]              
1 17561U 87022A   17170.33178713 -.00000075  00000-0  00000-0 0  9991
2 17561  15.1487   5.7963 0004251 303.8483 253.7041  0.99909243 94166
GOES 8 [-]              
1 23051U 94022A   17169.84531765 -.00000239  00000-0  00000-0 0  9996
2 23051  11.3943  38.8842 0005649 242.8703 273.7302  0.98907721 91622
GOES 9 [-]              
1 23581U 95025A   17170.44012824 -.00000015  00000-0  00000-0 0  9998
2 23581  10.8948  38.3109 0003157  78.5334 165.2428  0.98800178 80299
GOES 10 [-]             
1 24786U 97019A   17169.58072774 -.00000133  00000-0  00000-0 0  9995
2 24786   9.2711  43.0265 0029158 162.0609 197.9871  0.99122226 73496
GOES 11 [-]             
1 26352U 00022A   17170.15008844 -.00000236  00000-0  00000-0 0  9990
2 26352   4.9605  73.9603 0002995 141.2977  67.2637  0.99044373 62466
GOES 12 [-]             
1 26871U 01031A   17169.84502797 -.00000253  00000-0  00000-0 0  9996
2 26871   6.3387  60.0067 0008117 236.2350 246.8262  0.99140210 58166
GOES 13 [+]             
1 29155U 06018A   17169.46771000 -.00000249  00000-0  00000-0 0  9992
2 29155   0.1725 272.7827 0004182 180.0857 267.1862  1.00281794 10441
GOES 14 [S]             
1 35491U 09033A   17169.54814163 -.00000093  00000-0  00000-0 0  9996
2 35491   0.2701 102.0018 0005056 114.9914 142.9775  1.00269763 29225
GOES 15 [+]             
1 36411U 10008A   17169.63431645  .00000090  00000-0  00000-0 0  9999
2 36411   0.2035 103.1112 0002231  62.9931 193.9077  1.00268106 26732
GOES 16 [S]             
1 41866U 16071A   17170.50444060 -.00000183  00000-0  00000-0 0  9992
2 41866   0.0029  81.7186 0000474  45.7899 232.4957  1.00270158  2172
"
