\relax 
\providecommand\hyper@newdestlabel[2]{}
\providecommand\HyperFirstAtBeginDocument{\AtBeginDocument}
\HyperFirstAtBeginDocument{\ifx\hyper@anchor\@undefined
\global\let\oldcontentsline\contentsline
\gdef\contentsline#1#2#3#4{\oldcontentsline{#1}{#2}{#3}}
\global\let\oldnewlabel\newlabel
\gdef\newlabel#1#2{\newlabelxx{#1}#2}
\gdef\newlabelxx#1#2#3#4#5#6{\oldnewlabel{#1}{{#2}{#3}}}
\AtEndDocument{\ifx\hyper@anchor\@undefined
\let\contentsline\oldcontentsline
\let\newlabel\oldnewlabel
\fi}
\fi}
\global\let\hyper@last\relax 
\gdef\HyperFirstAtBeginDocument#1{#1}
\providecommand\HyField@AuxAddToFields[1]{}
\providecommand\HyField@AuxAddToCoFields[2]{}
\citation{thermica}
\citation{CERESmodel}
\citation{CERESmodel}
\@writefile{toc}{\contentsline {section}{\numberline {1}Introduction}{6}{section.1}\protected@file@percent }
\@writefile{lof}{\contentsline {figure}{\numberline {1}{\ignorespaces Evolution of Simusat.\relax }}{6}{figure.caption.4}\protected@file@percent }
\providecommand*\caption@xref[2]{\@setref\relax\@undefined{#1}}
\newlabel{crono}{{1}{6}{Evolution of Simusat.\relax }{figure.caption.4}{}}
\@writefile{toc}{\contentsline {section}{\numberline {2}Methodology}{7}{section.2}\protected@file@percent }
\@writefile{toc}{\contentsline {subsection}{\numberline {2.1}Programming environment}{7}{subsection.2.1}\protected@file@percent }
\@writefile{toc}{\contentsline {subsection}{\numberline {2.2}Forge: ISAE Openforge}{7}{subsection.2.2}\protected@file@percent }
\@writefile{toc}{\contentsline {subsection}{\numberline {2.3}Git}{7}{subsection.2.3}\protected@file@percent }
\citation{thermica}
\citation{thermica}
\citation{PolyThermo}
\@writefile{lof}{\contentsline {figure}{\numberline {2}{\ignorespaces Git branches.\relax }}{8}{figure.caption.5}\protected@file@percent }
\newlabel{git}{{2}{8}{Git branches.\relax }{figure.caption.5}{}}
\@writefile{toc}{\contentsline {subsection}{\numberline {2.4}Unit tests and integration tests}{8}{subsection.2.4}\protected@file@percent }
\@writefile{toc}{\contentsline {section}{\numberline {3}Thermal module of the software}{8}{section.3}\protected@file@percent }
\@writefile{toc}{\contentsline {subsection}{\numberline {3.1}Introduction}{8}{subsection.3.1}\protected@file@percent }
\@writefile{toc}{\contentsline {subsection}{\numberline {3.2}Thermal model}{8}{subsection.3.2}\protected@file@percent }
\@writefile{lof}{\contentsline {figure}{\numberline {3}{\ignorespaces Screen shot of Systema-Thermica \cite  {thermica}.\relax }}{9}{figure.caption.6}\protected@file@percent }
\newlabel{fig:thermica}{{3}{9}{Screen shot of Systema-Thermica \cite {thermica}.\relax }{figure.caption.6}{}}
\@writefile{lof}{\contentsline {figure}{\numberline {4}{\ignorespaces Nodes in the thermal model.\relax }}{9}{figure.caption.7}\protected@file@percent }
\newlabel{fig:sat-node}{{4}{9}{Nodes in the thermal model.\relax }{figure.caption.7}{}}
\newlabel{eq:gen-ener-bal}{{1}{9}{Thermal model}{equation.3.1}{}}
\@writefile{toc}{\contentsline {subsection}{\numberline {3.3}Thermal exchanges}{10}{subsection.3.3}\protected@file@percent }
\newlabel{subsec: thermal exchanges}{{3.3}{10}{Thermal exchanges}{subsection.3.3}{}}
\@writefile{toc}{\contentsline {subsubsection}{\numberline {3.3.1}Radiation}{10}{subsubsection.3.3.1}\protected@file@percent }
\newlabel{eq:St-Bolt-law}{{2}{10}{Radiation}{equation.3.2}{}}
\newlabel{eq:view-fact-reci}{{3}{10}{Radiation}{equation.3.3}{}}
\citation{EarthIRCFactor}
\newlabel{eq:Phi1_2}{{4}{11}{Radiation}{equation.3.4}{}}
\newlabel{eq: sun-rad}{{5}{11}{Solar radiation}{equation.3.5}{}}
\@writefile{lof}{\contentsline {figure}{\numberline {5}{\ignorespaces Configuration satellite-Sun.\relax }}{11}{figure.caption.9}\protected@file@percent }
\newlabel{fig:sun-sat}{{5}{11}{Configuration satellite-Sun.\relax }{figure.caption.9}{}}
\newlabel{eq: sun-face}{{6}{11}{Solar radiation}{equation.3.6}{}}
\@writefile{lot}{\contentsline {table}{\numberline {1}{\ignorespaces Earth-flat plate view factor\relax }}{12}{table.caption.11}\protected@file@percent }
\newlabel{tb:earth-view-factor}{{1}{12}{Earth-flat plate view factor\relax }{table.caption.11}{}}
\@writefile{lof}{\contentsline {figure}{\numberline {6}{\ignorespaces Relative position of Earth and spacecraft.\relax }}{12}{figure.caption.12}\protected@file@percent }
\newlabel{fig:earth-view-factor}{{6}{12}{Relative position of Earth and spacecraft.\relax }{figure.caption.12}{}}
\newlabel{eq:Phi_earth}{{7}{12}{Earth infrared radiation}{equation.3.7}{}}
\newlabel{eq: alb-face}{{8}{13}{Albedo radiation}{equation.3.8}{}}
\@writefile{lof}{\contentsline {figure}{\numberline {7}{\ignorespaces Relative position of Earth, Sun and spacecraft.\relax }}{13}{figure.caption.14}\protected@file@percent }
\newlabel{fig:earth-sat-sun}{{7}{13}{Relative position of Earth, Sun and spacecraft.\relax }{figure.caption.14}{}}
\newlabel{eq: fac-view-alb}{{9}{13}{Albedo radiation}{equation.3.9}{}}
\newlabel{eq:Phi-space}{{10}{13}{Radiation towards open space}{equation.3.10}{}}
\@writefile{toc}{\contentsline {subsubsection}{\numberline {3.3.2}Conduction}{13}{subsubsection.3.3.2}\protected@file@percent }
\newlabel{eq: conduction}{{11}{14}{Conduction}{equation.3.11}{}}
\@writefile{toc}{\contentsline {subsubsection}{\numberline {3.3.3}Convection}{14}{subsubsection.3.3.3}\protected@file@percent }
\@writefile{toc}{\contentsline {subsection}{\numberline {3.4}Implementation}{14}{subsection.3.4}\protected@file@percent }
\@writefile{toc}{\contentsline {subsubsection}{\numberline {3.4.1}Central body}{14}{subsubsection.3.4.1}\protected@file@percent }
\newlabel{eq: bal-body}{{12}{14}{Central body}{equation.3.12}{}}
\@writefile{toc}{\contentsline {subsubsection}{\numberline {3.4.2}Solar panel}{14}{subsubsection.3.4.2}\protected@file@percent }
\@writefile{lof}{\contentsline {figure}{\numberline {8}{\ignorespaces Types of solar panel in the software.\relax }}{15}{figure.caption.16}\protected@file@percent }
\newlabel{fig:solar-pan-types}{{8}{15}{Types of solar panel in the software.\relax }{figure.caption.16}{}}
\newlabel{bal-pan}{{13}{15}{Solar panel}{equation.3.13}{}}
\@writefile{toc}{\contentsline {subsubsection}{\numberline {3.4.3}Central body - solar panel interaction}{15}{subsubsection.3.4.3}\protected@file@percent }
\newlabel{bal-sat-pan}{{14}{15}{Central body balance (with interaction)}{equation.3.14}{}}
\newlabel{bal-pan-sat}{{15}{15}{Type 2 solar panel balance (with interaction)}{equation.3.15}{}}
\citation{CERESFaQ}
\citation{CERESmodel}
\citation{CERESmodel}
\citation{CERESmodel}
\citation{CERESmodel}
\citation{CERESmodel}
\citation{CERESmodel}
\@writefile{toc}{\contentsline {subsubsection}{\numberline {3.4.4}Energy balance solution}{16}{subsubsection.3.4.4}\protected@file@percent }
\@writefile{toc}{\contentsline {subsection}{\numberline {3.5}CERES model for albedo and Earth infra-red radiation}{16}{subsection.3.5}\protected@file@percent }
\newlabel{sec:CERES}{{3.5}{16}{CERES model for albedo and Earth infra-red radiation}{subsection.3.5}{}}
\@writefile{toc}{\contentsline {subsubsection}{\numberline {3.5.1}Introduction}{16}{subsubsection.3.5.1}\protected@file@percent }
\@writefile{toc}{\contentsline {subsubsection}{\numberline {3.5.2}Implementation of the model}{16}{subsubsection.3.5.2}\protected@file@percent }
\@writefile{lof}{\contentsline {figure}{\numberline {9}{\ignorespaces Representation of albedo coefficient distribution in latitude for each month adapted from \cite  {CERESmodel}.\relax }}{17}{figure.caption.19}\protected@file@percent }
\newlabel{fig:CER-alb-rep}{{9}{17}{Representation of albedo coefficient distribution in latitude for each month adapted from \cite {CERESmodel}.\relax }{figure.caption.19}{}}
\@writefile{toc}{\contentsline {subsection}{\numberline {3.6}Update of the tab \textit  {Environment}}{17}{subsection.3.6}\protected@file@percent }
\@writefile{lof}{\contentsline {figure}{\numberline {10}{\ignorespaces Representation of Earth temperature (K) distribution in latitude for each month adapted from \cite  {CERESmodel}.\relax }}{18}{figure.caption.20}\protected@file@percent }
\newlabel{fig:CER-ir-rep}{{10}{18}{Representation of Earth temperature (K) distribution in latitude for each month adapted from \cite {CERESmodel}.\relax }{figure.caption.20}{}}
\@writefile{toc}{\contentsline {subsection}{\numberline {3.7}Update of the \textit  {Mass, geometry} tab}{18}{subsection.3.7}\protected@file@percent }
\newlabel{subsec: update mass geom}{{3.7}{18}{Update of the \textit {Mass, geometry} tab}{subsection.3.7}{}}
\@writefile{toc}{\contentsline {subsection}{\numberline {3.8}Unit tests and integration test}{18}{subsection.3.8}\protected@file@percent }
\@writefile{lof}{\contentsline {figure}{\numberline {11}{\ignorespaces Albedo flux received by a face pointing Nadir in a circular polar orbit.\relax }}{19}{figure.caption.21}\protected@file@percent }
\newlabel{fig:alb-flux-2months}{{11}{19}{Albedo flux received by a face pointing Nadir in a circular polar orbit.\relax }{figure.caption.21}{}}
\@writefile{lof}{\contentsline {figure}{\numberline {12}{\ignorespaces Old \textit  {Environment} tab inside Mission Design (detail).\relax }}{19}{figure.caption.22}\protected@file@percent }
\newlabel{fig:old-env-win}{{12}{19}{Old \textit {Environment} tab inside Mission Design (detail).\relax }{figure.caption.22}{}}
\@writefile{toc}{\contentsline {section}{\numberline {4}Saved data restructuring}{19}{section.4}\protected@file@percent }
\@writefile{lof}{\contentsline {figure}{\numberline {13}{\ignorespaces New \textit  {Environment} tab inside Mission Design (detail).\relax }}{20}{figure.caption.23}\protected@file@percent }
\newlabel{fig:new-env-win}{{13}{20}{New \textit {Environment} tab inside Mission Design (detail).\relax }{figure.caption.23}{}}
\@writefile{lof}{\contentsline {figure}{\numberline {14}{\ignorespaces Display of CERES model in the software.\relax }}{20}{figure.caption.24}\protected@file@percent }
\newlabel{fig:new-env-win-Cg}{{14}{20}{Display of CERES model in the software.\relax }{figure.caption.24}{}}
\@writefile{toc}{\contentsline {subsection}{\numberline {4.1}.att files}{20}{subsection.4.1}\protected@file@percent }
\@writefile{lof}{\contentsline {figure}{\numberline {15}{\ignorespaces Old Satellite configuration tab (detail).\relax }}{21}{figure.caption.25}\protected@file@percent }
\newlabel{fig:old-satconf-win}{{15}{21}{Old Satellite configuration tab (detail).\relax }{figure.caption.25}{}}
\@writefile{lof}{\contentsline {figure}{\numberline {16}{\ignorespaces Updated Satellite configuration tab (detail).\relax }}{21}{figure.caption.26}\protected@file@percent }
\newlabel{fig:new-satconf-win}{{16}{21}{Updated Satellite configuration tab (detail).\relax }{figure.caption.26}{}}
\@writefile{toc}{\contentsline {subsection}{\numberline {4.2}.orb files}{21}{subsection.4.2}\protected@file@percent }
\@writefile{toc}{\contentsline {subsection}{\numberline {4.3}Main window update}{21}{subsection.4.3}\protected@file@percent }
\@writefile{lot}{\contentsline {table}{\numberline {2}{\ignorespaces Unit and integration tests run time.\relax }}{22}{table.caption.27}\protected@file@percent }
\newlabel{tb:Unit and integration tests run time.}{{2}{22}{Unit and integration tests run time.\relax }{table.caption.27}{}}
\@writefile{toc}{\contentsline {section}{\numberline {5}Bonus development}{22}{section.5}\protected@file@percent }
\@writefile{toc}{\contentsline {subsection}{\numberline {5.1}Shadow background for eclipses in Graphs}{22}{subsection.5.1}\protected@file@percent }
\@writefile{lof}{\contentsline {figure}{\numberline {17}{\ignorespaces Main window Simusat 2017 (version 5.0).\relax }}{23}{figure.caption.28}\protected@file@percent }
\newlabel{fig:old-main}{{17}{23}{Main window Simusat 2017 (version 5.0).\relax }{figure.caption.28}{}}
\@writefile{lof}{\contentsline {figure}{\numberline {18}{\ignorespaces Main window Simusat 2019 (version 6.3 and on).\relax }}{23}{figure.caption.29}\protected@file@percent }
\newlabel{fig:new-main}{{18}{23}{Main window Simusat 2019 (version 6.3 and on).\relax }{figure.caption.29}{}}
\@writefile{toc}{\contentsline {subsection}{\numberline {5.2}Aerodynamic torque correction}{23}{subsection.5.2}\protected@file@percent }
\citation{Torques}
\@writefile{lof}{\contentsline {figure}{\numberline {19}{\ignorespaces Cells shaded to indicate eclipse.\relax }}{24}{figure.caption.30}\protected@file@percent }
\newlabel{fig:report-eclipse}{{19}{24}{Cells shaded to indicate eclipse.\relax }{figure.caption.30}{}}
\@writefile{lof}{\contentsline {figure}{\numberline {20}{\ignorespaces Background shaded to indicate eclipse.\relax }}{24}{figure.caption.31}\protected@file@percent }
\newlabel{fig:graph-eclipse}{{20}{24}{Background shaded to indicate eclipse.\relax }{figure.caption.31}{}}
\newlabel{eq:aero_torque}{{16}{24}{Aerodynamic torque correction}{equation.5.16}{}}
\citation{bugs}
\@writefile{toc}{\contentsline {section}{\numberline {6}Bug Fixing}{25}{section.6}\protected@file@percent }
\@writefile{toc}{\contentsline {subsection}{\numberline {6.1}Fatal bugs}{25}{subsection.6.1}\protected@file@percent }
\@writefile{lot}{\contentsline {table}{\numberline {3}{\ignorespaces Fatal bugs analysis and solution\relax }}{25}{table.caption.32}\protected@file@percent }
\newlabel{tb:fatal-bugs}{{3}{25}{Fatal bugs analysis and solution\relax }{table.caption.32}{}}
\@writefile{toc}{\contentsline {subsection}{\numberline {6.2}Major bugs}{26}{subsection.6.2}\protected@file@percent }
\@writefile{lot}{\contentsline {table}{\numberline {4}{\ignorespaces Major bugs analysis and solution\relax }}{26}{table.caption.33}\protected@file@percent }
\newlabel{tb:Major-bugs}{{4}{26}{Major bugs analysis and solution\relax }{table.caption.33}{}}
\@writefile{toc}{\contentsline {subsection}{\numberline {6.3}Minor bugs}{26}{subsection.6.3}\protected@file@percent }
\@writefile{lot}{\contentsline {table}{\numberline {5}{\ignorespaces Minor bugs analysis and solution\relax }}{27}{table.caption.34}\protected@file@percent }
\newlabel{tb:Minor-bugs}{{5}{27}{Minor bugs analysis and solution\relax }{table.caption.34}{}}
\@writefile{toc}{\contentsline {section}{\numberline {7}Software deployment}{27}{section.7}\protected@file@percent }
\@writefile{toc}{\contentsline {subsection}{\numberline {7.1}Standalone version}{28}{subsection.7.1}\protected@file@percent }
\@writefile{toc}{\contentsline {subsection}{\numberline {7.2}Installable version}{28}{subsection.7.2}\protected@file@percent }
\@writefile{toc}{\contentsline {section}{\numberline {8}Conclusions and future works}{28}{section.8}\protected@file@percent }
\bibdata{Bibliography}
\bibcite{thermica}{1}
\bibcite{CERESmodel}{2}
\bibcite{PolyThermo}{3}
\bibcite{EarthIRCFactor}{4}
\bibcite{CERESFaQ}{5}
\bibcite{Torques}{6}
\bibcite{bugs}{7}
\bibstyle{ieeetr}
\@writefile{toc}{\contentsline {section}{Appendices}{30}{section*.36}\protected@file@percent }
\@writefile{toc}{\contentsline {section}{\numberline {A}Fatal bugs full description}{30}{appendix.A}\protected@file@percent }
\newlabel{appendA}{{A}{30}{Fatal bugs full description}{appendix.A}{}}
\@writefile{toc}{\contentsline {subsection}{\numberline {A.1}Resetting satellite data}{30}{subsection.A.1}\protected@file@percent }
\@writefile{toc}{\contentsline {subsection}{\numberline {A.2}InvalidCastExeption. Unable to convert the string to date}{30}{subsection.A.2}\protected@file@percent }
\@writefile{lof}{\contentsline {figure}{\numberline {21}{\ignorespaces Error when the start date is 23h.\relax }}{30}{figure.caption.41}\protected@file@percent }
\newlabel{fig:bug-conv-date}{{21}{30}{Error when the start date is 23h.\relax }{figure.caption.41}{}}
\@writefile{toc}{\contentsline {subsection}{\numberline {A.3}Automatic update of \textit  {Parameters} of the to-be-plotted list}{30}{subsection.A.3}\protected@file@percent }
\@writefile{lof}{\contentsline {figure}{\numberline {22}{\ignorespaces Items to be plotted evolution when removing a solar panel.\relax }}{31}{figure.caption.43}\protected@file@percent }
\newlabel{fig:bug-panel-removal}{{22}{31}{Items to be plotted evolution when removing a solar panel.\relax }{figure.caption.43}{}}
\@writefile{toc}{\contentsline {subsection}{\numberline {A.4}Export of \textit  {Power Report} in Excel format}{31}{subsection.A.4}\protected@file@percent }
\@writefile{toc}{\contentsline {section}{\numberline {B}Major bugs full description}{31}{appendix.B}\protected@file@percent }
\newlabel{appendB}{{B}{31}{Major bugs full description}{appendix.B}{}}
\@writefile{toc}{\contentsline {subsection}{\numberline {B.1}Solar panel surface}{31}{subsection.B.1}\protected@file@percent }
\newlabel{subsec:Bug-surface}{{B.1}{31}{Solar panel surface}{subsection.B.1}{}}
\@writefile{lof}{\contentsline {figure}{\numberline {23}{\ignorespaces Commented lines to make operative the saving of the report in Excel format.\relax }}{32}{figure.caption.47}\protected@file@percent }
\newlabel{fig:bug-save-excel}{{23}{32}{Commented lines to make operative the saving of the report in Excel format.\relax }{figure.caption.47}{}}
\@writefile{toc}{\contentsline {subsection}{\numberline {B.2}Number of solar cell chains in the solar panels}{32}{subsection.B.2}\protected@file@percent }
\newlabel{subsec:Bug-NbStrings}{{B.2}{32}{Number of solar cell chains in the solar panels}{subsection.B.2}{}}
\@writefile{toc}{\contentsline {subsection}{\numberline {B.3}Repetition of solar panel allowed if they are modified}{32}{subsection.B.3}\protected@file@percent }
\@writefile{lof}{\contentsline {figure}{\numberline {24}{\ignorespaces Code used to avoid superposition or repetition of solar panels.\relax }}{33}{figure.caption.54}\protected@file@percent }
\newlabel{fig:bug-modify-panel}{{24}{33}{Code used to avoid superposition or repetition of solar panels.\relax }{figure.caption.54}{}}
\@writefile{toc}{\contentsline {subsection}{\numberline {B.4}Automatic orbit change if no type is selected}{33}{subsection.B.4}\protected@file@percent }
\@writefile{toc}{\contentsline {subsection}{\numberline {B.5}Change of satellite's attitude}{33}{subsection.B.5}\protected@file@percent }
\newlabel{sec:Att_mod_bug}{{B.5}{33}{Change of satellite's attitude}{subsection.B.5}{}}
\@writefile{lof}{\contentsline {figure}{\numberline {25}{\ignorespaces Commented code lines to solve the bug that changes the orbital parameters.\relax }}{34}{figure.caption.57}\protected@file@percent }
\newlabel{fig:bug-act-orbit}{{25}{34}{Commented code lines to solve the bug that changes the orbital parameters.\relax }{figure.caption.57}{}}
\@writefile{toc}{\contentsline {section}{\numberline {C}Minor bugs full description}{34}{appendix.C}\protected@file@percent }
\newlabel{appendC}{{C}{34}{Minor bugs full description}{appendix.C}{}}
\@writefile{toc}{\contentsline {subsection}{\numberline {C.1}Start and Current dates on the Main window are not updated after modifying the orbit epoch}{34}{subsection.C.1}\protected@file@percent }
\@writefile{toc}{\contentsline {subsection}{\numberline {C.2}Update of simulation dates in the windows \textit  {Curves} and \textit  {Report}}{34}{subsection.C.2}\protected@file@percent }
\@writefile{lof}{\contentsline {figure}{\numberline {26}{\ignorespaces Code lines to update the dates in the Main window.\relax }}{35}{figure.caption.62}\protected@file@percent }
\newlabel{fig:bug-date-main}{{26}{35}{Code lines to update the dates in the Main window.\relax }{figure.caption.62}{}}
\@writefile{lof}{\contentsline {figure}{\numberline {27}{\ignorespaces Sub Procedure to update the dates in the Curves and Report windows.\relax }}{35}{figure.caption.65}\protected@file@percent }
\newlabel{fig:bug-act-dates}{{27}{35}{Sub Procedure to update the dates in the Curves and Report windows.\relax }{figure.caption.65}{}}
\@writefile{toc}{\contentsline {subsection}{\numberline {C.3}\textit  {Curves: Energy} window's calendar}{36}{subsection.C.3}\protected@file@percent }
\newlabel{subsec:Bug-Calendier}{{C.3}{36}{\textit {Curves: Energy} window's calendar}{subsection.C.3}{}}
\@writefile{toc}{\contentsline {subsection}{\numberline {C.4}Possible items for display in \textit  {Curves: Energy}}{36}{subsection.C.4}\protected@file@percent }
\@writefile{lof}{\contentsline {figure}{\numberline {28}{\ignorespaces items that can be displayed when the window is opened 1, 2 and 3 times.\relax }}{36}{figure.caption.70}\protected@file@percent }
\newlabel{fig:bug-items-powergraph}{{28}{36}{items that can be displayed when the window is opened 1, 2 and 3 times.\relax }{figure.caption.70}{}}
\@writefile{toc}{\contentsline {subsection}{\numberline {C.5}\textit  {Panels Parameters} are not disabled by default in \textit  {Curves} windows}{37}{subsection.C.5}\protected@file@percent }
\@writefile{lof}{\contentsline {figure}{\numberline {29}{\ignorespaces Selection of panel parameters if no panel exists.\relax }}{37}{figure.caption.72}\protected@file@percent }
\newlabel{fig:bug-pwrgraph-1}{{29}{37}{Selection of panel parameters if no panel exists.\relax }{figure.caption.72}{}}
\@writefile{lof}{\contentsline {figure}{\numberline {30}{\ignorespaces Lines added to prevent the activation of panel parameters.\relax }}{37}{figure.caption.74}\protected@file@percent }
\newlabel{fig:bug-pwrgraph-11}{{30}{37}{Lines added to prevent the activation of panel parameters.\relax }{figure.caption.74}{}}
\@writefile{toc}{\contentsline {subsection}{\numberline {C.6}Updating the Y axis in the solar flux display}{38}{subsection.C.6}\protected@file@percent }
\@writefile{lof}{\contentsline {figure}{\numberline {31}{\ignorespaces path to Y axis properties.\relax }}{38}{figure.caption.77}\protected@file@percent }
\newlabel{fig:bug-env-axis}{{31}{38}{path to Y axis properties.\relax }{figure.caption.77}{}}
\@writefile{toc}{\contentsline {subsection}{\numberline {C.7}Warning message in attitude configuration window when plotting battery parameters}{38}{subsection.C.7}\protected@file@percent }
\@writefile{toc}{\contentsline {subsection}{\numberline {C.8}Orbit file name changes after saving it}{39}{subsection.C.8}\protected@file@percent }
\@writefile{toc}{\contentsline {subsection}{\numberline {C.9}Mouse shown when there is an error in the \textit  {Energy Report} saving}{39}{subsection.C.9}\protected@file@percent }
\@writefile{lof}{\contentsline {figure}{\numberline {32}{\ignorespaces Added lines to return the mouse to its default shape and warn the user.\relax }}{39}{figure.caption.84}\protected@file@percent }
\newlabel{fig:bug-thinking-mouse}{{32}{39}{Added lines to return the mouse to its default shape and warn the user.\relax }{figure.caption.84}{}}
