"GPS BIIR-2  (PRN 13)    
1 24876U 97035A   22151.41057485  .00000053  00000+0  00000+0 0  9992
2 24876  55.5086 156.3382 0057660  51.0833 309.4483  2.00563411182318
GPS BIIR-4  (PRN 20)    
1 26360U 00025A   22151.77930530 -.00000058  00000+0  00000+0 0  9991
2 26360  54.0454  79.5547 0047838 184.0081 170.6295  2.00573769161636
GPS BIIR-6  (PRN 22)    
1 26605U 00071A   22151.76888571  .00000049  00000+0  00000+0 0  9999
2 26605  55.0921 153.3240 0136077 254.2498 223.1314  2.00560768157888
GPS BIIR-8  (PRN 16)    
1 27663U 03005A   22151.79573535 -.00000029  00000+0  00000+0 0  9997
2 27663  55.5234 273.7229 0125796  41.0573 306.0927  2.00565663141671
GPS BIIR-9  (PRN 21)    
1 27704U 03010A   22151.74712508 -.00000098  00000+0  00000+0 0  9995
2 27704  55.0183  23.9818 0244986 305.6733 223.7156  2.00555375140479
GPS BIIR-11 (PRN 19)    
1 28190U 04009A   22151.60566546 -.00000084  00000+0  00000+0 0  9993
2 28190  56.0148 334.7063 0090486 119.6480 246.3608  2.00560889133316
GPS BIIR-13 (PRN 02)    
1 28474U 04045A   22151.72182596 -.00000097  00000+0  00000+0 0  9994
2 28474  55.3455  24.1142 0206514 278.8758  80.5630  2.00564310128803
GPS BIIRM-1 (PRN 17)    
1 28874U 05038A   22151.83075979 -.00000081  00000+0  00000+0 0  9992
2 28874  56.0815 332.1314 0137177 274.4499 275.1610  2.00577587122208
GPS BIIRM-2 (PRN 31)    
1 29486U 06042A   22151.86274904  .00000047  00000+0  00000+0 0  9991
2 29486  54.7159 209.9332 0103294  21.2772 109.2378  2.00554997114760
GPS BIIRM-3 (PRN 12)    
1 29601U 06052A   22151.62194219 -.00000029  00000+0  00000+0 0  9996
2 29601  55.5298 272.6668 0084299  74.1095 286.8164  2.00550155113776
GPS BIIRM-4 (PRN 15)    
1 32260U 07047A   22151.44124757  .00000033  00000+0  00000+0 0  9990
2 32260  53.3105 141.2486 0138790  62.3397 299.0499  2.00549161107172
GPS BIIRM-5 (PRN 29)    
1 32384U 07062A   22151.75257681 -.00000082  00000+0  00000+0 0  9996
2 32384  56.1999 332.8932 0020216 135.1344 221.4756  2.00561252105874
GPS BIIRM-6 (PRN 07)    
1 32711U 08012A   22151.35465927  .00000050  00000+0  00000+0 0  9990
2 32711  54.4756 208.8929 0163230 230.7685 127.8600  2.00564871104115
GPS BIIRM-8 (PRN 05)    
1 35752U 09043A   22151.83489757 -.00000047  00000+0  00000+0 0  9990
2 35752  55.0591  86.1964 0058205  57.8996 305.8995  2.00557136 93737
GPS BIIF-1  (PRN 25)    
1 36585U 10022A   22151.69498069 -.00000024  00000+0  00000+0 0  9999
2 36585  54.8123 268.1949 0103117  56.8896 322.4174  2.00564512 87964
GPS BIIF-2  (PRN 01)    
1 37753U 11036A   22150.02893899 -.00000099  00000+0  00000+0 0  9991
2 37753  56.5977  29.4204 0117435  51.5792 289.7777  2.00565428 79608
GPS BIIF-3  (PRN 24)    
1 38833U 12053A   22151.03621581  .00000054  00000+0  00000+0 0  9990
2 38833  53.5304 204.0635 0123201  46.0199 315.0804  2.00561680 69795
GPS BIIF-4  (PRN 27)    
1 39166U 13023A   22151.39343891 -.00000082  00000+0  00000+0 0  9994
2 39166  55.7098 328.5277 0104034  38.1647 322.5652  2.00566160 66245
GPS BIIF-5  (PRN 30)    
1 39533U 14008A   22151.39172204  .00000048  00000+0  00000+0 0  9995
2 39533  53.6247 209.5535 0059626 208.1565 151.6085  2.00552732 60048
GPS BIIF-6  (PRN 06)    
1 39741U 14026A   22151.67229486 -.00000094  00000+0  00000+0 0  9994
2 39741  56.5606  28.8821 0027182 307.8232  51.9836  2.00557400 58905
GPS BIIF-7  (PRN 09)    
1 40105U 14045A   22151.25822943  .00000043  00000+0  00000+0 0  9995
2 40105  54.6889 147.4903 0018706 109.3485 250.8551  2.00576931 57328
GPS BIIF-8  (PRN 03)    
1 40294U 14068A   22151.63483221 -.00000044  00000+0  00000+0 0  9995
2 40294  55.8033  88.5993 0040349  53.3836 306.9575  2.00570471 55578
GPS BIIF-9  (PRN 26)    
1 40534U 15013A   22151.77113295 -.00000022  00000+0  00000+0 0  9995
2 40534  53.7135 265.3870 0068571  20.6262 339.6610  2.00553568 52197
GPS BIIF-10 (PRN 08)    
1 40730U 15033A   22151.43699569 -.00000082  00000+0  00000+0 0  9997
2 40730  55.2087 327.3633 0074202   8.0303 352.0826  2.00552869 50355
GPS BIIF-11 (PRN 10)    
1 41019U 15062A   22151.48219441 -.00000046  00000+0  00000+0 0  9992
2 41019  55.7921  88.4478 0077572 218.4281 140.9900  2.00562878 48192
GPS BIIF-12 (PRN 32)    
1 41328U 16007A   22151.57441370  .00000044  00000+0  00000+0 0  9990
2 41328  54.9070 148.1455 0061728 230.5896 128.8636  2.00571571 46204
GPS BIII-1  (PRN 04)    
1 43873U 18109A   22151.45656469  .00000047  00000+0  00000+0 0  9999
2 43873  55.0871 150.5651 0018837 197.0743 333.2906  2.00570863 25435
GPS BIII-2  (PRN 18)    
1 44506U 19056A   22152.09363292 -.00000094  00000+0  00000+0 0  9998
2 44506  55.6714  29.6982 0023211 178.2582 354.9301  2.00557337 20444
GPS BIII-3  (PRN 23)    
1 45854U 20041A   22151.73776420 -.00000046  00000+0  00000+0 0  9999
2 45854  55.5102  86.9829 0021578 177.7849  34.4106  2.00559474 14407
GPS BIII-4  (PRN 14)    
1 46826U 20078A   22151.70745962 -.00000028  00000+0  00000+0 0  9993
2 46826  54.5780 270.7754 0019491 185.5423 339.3520  2.00565344 11872
GPS BIII-5  (PRN 11)    
1 48859U 21054A   22151.47827362 -.00000097  00000+0  00000+0 0  9991
2 48859  55.1764  31.7312 0003978 194.9523 347.5055  2.00574866  7117
"
