"SAUDISAT 1C             
1 27607U 02058C   22151.85840295  .00000371  00000+0  71654-4 0  9996
2 27607  64.5555 352.6848 0077516 297.6729  61.6521 14.76113696 45923
SAUDISAT 2              
1 28371U 04025F   22151.84641950  .00000297  00000+0  80356-4 0  9993
2 28371  98.3764 108.5563 0025882 153.5488 206.7031 14.54553383950876
SAUDISAT 3              
1 31118U 07012B   22151.28143628  .00000153  00000+0  34133-4 0  9995
2 31118  97.9686  98.7424 0013757 248.7795 111.1942 14.69321985810589
PISAT                   
1 41784U 16059B   22151.53087947  .00000448  00000+0  94074-4 0  9992
2 41784  97.9166 195.5403 0030870 221.0149 138.8733 14.63892768303214
FLYING LAPTOP           
1 42831U 17042G   22151.76048883  .00001675  00000+0  17104-3 0  9991
2 42831  97.4251   7.1886 0015355  66.7724 293.5115 14.91762514265604
SALSAT                  
1 46495U 20068K   22151.80176874  .00001484  00000+0  11042-3 0  9993
2 46495  97.7281  93.0984 0015974 339.1703  20.8870 15.04447536 91687
"
