"TRANSIT 16 [?]          
1 02807U 67048A   19203.73333177  .00000041  00000-0  47037-4 0  9991
2 02807  89.6219  75.4650 0021445  30.4013  14.1521 13.50210412567728
TRANSIT 17 [?]          
1 02965U 67092A   19203.61684892  .00000059  00000-0  70644-4 0  9994
2 02965  89.2701 202.3786 0048056 171.5143 327.0032 13.52926001555195
TRANSIT 18 [?]          
1 03133U 68012A   19203.82292000  .00000031  00000-0  31438-4 0  9992
2 03133  89.9779 272.7283 0078046  92.6269  37.0324 13.51047069253949
NNSS 19 [?]             
1 04507U 70067A   19203.71031457  .00000041  00000-0  44756-4 0  9994
2 04507  89.8621 251.0104 0170770 214.2105 144.7951 13.50717030406965
NNSS O-20 [?]           
1 06909U 73081A   19204.21579690  .00000088  00000-0  81161-4 0  9995
2 06909  89.8184 298.1766 0155438 231.3340 127.3831 13.70522714484064
TRANSAT [?]             
1 10457U 77106A   19204.00937726  .00000032  00000-0  35299-4 0  9995
2 10457  89.7408 153.1324 0027873  84.0619 320.5487 13.48608679 52951
NOVA I [?]              
1 12458U 81044A   19204.23835774  .00000032  00000-0  55524-4 0  9992
2 12458  89.9301 117.1487 0016363  62.0788  54.5570 13.23002244843430
NOVA 3 [?]              
1 15362U 84110A   19203.69095168  .00000016  00000-0  18126-4 0  9999
2 15362  90.0623  58.8435 0030033 285.9948 116.4356 13.22772110678278
OSCAR 30 [?]            
1 15935U 85066A   19203.73566012  .00000017  00000-0  15613-4 0  9991
2 15935  90.1486  60.8425 0168917 189.4598 220.7746 13.35671823652879
OSCAR 24 [?]            
1 15936U 85066B   19203.70199035  .00000023  00000-0  26126-4 0  9994
2 15936  90.1366  53.7467 0169220 194.3877 209.6902 13.35541240654733
POLAR BEAR [?]          
1 17070U 86088A   19203.80285559  .00000040  00000-0  30517-4 0  9996
2 17070  89.5283 289.1290 0037242 322.4361 206.0164 13.74781225639212
OSCAR 27 [?]            
1 18361U 87080A   19203.87637582  .00000028  00000-0  31637-4 0  9997
2 18361  90.3177   0.3003 0106392  69.6377 291.6162 13.44479512561800
OSCAR 29 [?]            
1 18362U 87080B   19204.06292191  .00000065  00000-0  93516-4 0  9998
2 18362  90.3183   0.5568 0108246  86.9074  40.4986 13.44073936561716
OSCAR 23 [?]            
1 19070U 88033A   19203.89361826  .00000062  00000-0  10922-3 0  9992
2 19070  90.3699 300.6379 0190319 191.3342 298.6323 13.27451704512745
OSCAR 32 [?]            
1 19071U 88033B   19203.88185306  .00000050  00000-0  83176-4 0  9998
2 19071  90.3697 300.7102 0188809 180.1899 319.1298 13.27630823512979
NOVA 11 [?]             
1 19223U 88052A   19203.75913348 -.00000001  00000-0 -23217-4 0  9997
2 19223  89.9642  84.2217 0029891 331.0026  71.9465 13.22688409500791
OSCAR 25 [?]            
1 19419U 88074A   19203.94990297  .00000032  00000-0  37763-4 0  9990
2 19419  89.9899  18.0917 0098312  65.4550  88.0206 13.42213067513172
OSCAR 31 [?]            
1 19420U 88074B   19203.89700459 -.00000003  00000-0 -22702-4 0  9992
2 19420  89.9902  18.1659 0096240  59.8750  78.1142 13.42226084513273
"
