"NOAA 1 [-]              
1 04793U 70106A   22178.95846134 -.00000032  00000+0  77786-4 0  9991
2 04793 101.5559 242.5020 0031078 302.1989 230.8391 12.54005699358909
NOAA 2 (ITOS-D) [-]     
1 06235U 72082A   22178.91941566 -.00000034  00000+0  76463-4 0  9993
2 06235 101.9523 161.2179 0004513  57.2471 358.5614 12.53148411273289
NOAA 3 [-]              
1 06920U 73086A   22178.95165542 -.00000052  00000+0 -46543-4 0  9992
2 06920 102.2075 160.5160 0006057 273.4378 148.2882 12.40347788202097
NOAA 4 [-]              
1 07529U 74089A   22178.89857720 -.00000035  00000+0  67988-4 0  9997
2 07529 101.9127 158.5657 0009486  83.6777 331.6246 12.53158349177852
NOAA 5 [-]              
1 09057U 76077A   22178.90244826 -.00000030  00000+0  11124-3 0  9998
2 09057 102.0980 146.7796 0010168 117.4953 296.8591 12.37772010 75034
TIROS N [-]             
1 11060U 78096A   22178.85776517  .00000059  00000+0  49403-4 0  9991
2 11060  98.6347 232.3256 0011754 111.8384 248.4043 14.18393808473086
NOAA 6 [-]              
1 11416U 79057A   22178.94046390  .00000111  00000+0  55981-4 0  9990
2 11416  98.6631 189.8120 0009430 223.0870 136.9577 14.33766309243026
NOAA 7 [-]              
1 12553U 81059A   22178.89036990  .00000009  00000+0  27122-4 0  9999
2 12553  98.9982 223.4367 0012582  86.8705 273.3908 14.17334365119271
NOAA 8 [-]              
1 13923U 83022A   22178.93072814  .00000048  00000+0  36697-4 0  9993
2 13923  98.6862 169.4335 0015113 174.5010 185.6340 14.28812998 43904
NOAA 9 [-]              
1 15427U 84123A   22179.18036917  .00000044  00000+0  45308-4 0  9994
2 15427  99.0454 151.7332 0015582 132.1391 238.9436 14.16205821938369
NOAA 10 [-]             
1 16969U 86073A   22178.96056141  .00000036  00000+0  31913-4 0  9996
2 16969  98.5673 164.9216 0011021 283.7798 136.2938 14.28204411862330
NOAA 11 [-]             
1 19531U 88089A   22178.94690195  .00000013  00000+0  27667-4 0  9990
2 19531  98.4236 167.4527 0011824 143.4556 216.7428 14.15312521742300
NOAA 12 [-]             
1 21263U 91032A   22178.94710207  .00000045  00000+0  36911-4 0  9991
2 21263  98.5132 178.4753 0012719 312.4745  47.5360 14.25996772618221
NOAA 13 [-]             
1 22739U 93050A   22178.92765908  .00000045  00000+0  46591-4 0  9993
2 22739  98.5044 158.2060 0008709 319.7408  40.3119 14.12846503488779
NOAA 14 [-]             
1 23455U 94089A   22178.88452288  .00000027  00000+0  35335-4 0  9995
2 23455  98.4468 205.0230 0008369 298.0356  61.9971 14.14199788418188
NOAA 15 [B]             
1 25338U 98030A   22179.15421128  .00000121  00000+0  68830-4 0  9998
2 25338  98.6429 208.5496 0009152 265.7767  94.2367 14.26143508254794
NOAA 16 [-]             
1 26536U 00055A   22178.87485461  .00000035  00000+0  40980-4 0  9997
2 26536  98.6357 237.4169 0011431 132.1036 228.1111 14.13331842418829
NOAA 17 [-]             
1 27453U 02032A   22179.17469601  .00000028  00000+0  30796-4 0  9991
2 27453  98.6722 124.3099 0010782 238.2632 121.7497 14.25125223 40393
NOAA 18 [B]             
1 28654U 05018A   22179.18384411  .00000129  00000+0  93785-4 0  9997
2 28654  98.9488 249.6113 0013223 303.3937  56.5969 14.12746680881587
NOAA 19 [+]             
1 33591U 09005A   22179.11552946  .00000116  00000+0  87913-4 0  9998
2 33591  99.1467 213.4761 0014415 154.4922 205.6963 14.12581570689957
SUOMI NPP [+]           
1 37849U 11061A   22179.11520104  .00000013  00000+0  26737-4 0  9997
2 37849  98.7331 117.5194 0001067  86.6345 284.2805 14.19530657552707
NOAA 20 [+]             
1 43013U 17073A   22179.14855027  .00000019  00000+0  29667-4 0  9995
2 43013  98.7170 117.5355 0001505  72.6227 287.5113 14.19559071238742
"
