"CELESTIS-02             
1 25160U 98007D   22179.16575762 -.00000054  00000+0  33550-4 0  9997
2 25160 107.9826 288.3154 0060850  92.0088 332.4679 14.21630622264605
CELESTIS-03             
1 26034U 99070C   22179.11309765  .00009671  00000+0  46241-3 0  9995
2 26034  98.3102 186.1351 0012229  93.7512 266.5118 15.19183020222700
"
