"SARSAT 7 (NOAA 15)      
1 25338U 98030A   22179.15421128  .00000121  00000+0  68830-4 0  9998
2 25338  98.6429 208.5496 0009152 265.7767  94.2367 14.26143508254794
METEOSAT-8 (MSG-1)      
1 27509U 02040B   22178.77406015  .00000137  00000+0  00000+0 0  9998
2 27509   8.0562  50.6084 0001197   5.2537 180.0428  1.00275936 72712
GPS BIIR-08             
1 27663U 03005A   22178.21651413 -.00000024  00000+0  00000+0 0  9990
2 27663  55.5043 272.6745 0125493  41.1234 303.2814  2.00564101142209
GPS BIIR-11             
1 28190U 04009A   22178.51118226 -.00000096  00000+0  00000+0 0  9993
2 28190  55.9990 333.6460 0090682 121.1451 231.6087  2.00560359133840
GPS BIIR-13             
1 28474U 04045A   22178.35678941 -.00000091  00000+0  00000+0 0  9990
2 28474  55.3552  23.0453 0206080 279.1239 232.0084  2.00562465129335
SARSAT 10 (NOAA 18)     
1 28654U 05018A   22179.18384411  .00000129  00000+0  93785-4 0  9997
2 28654  98.9488 249.6113 0013223 303.3937  56.5969 14.12746680881587
GPS BIIR-14M            
1 28874U 05038A   22178.29423507 -.00000096  00000+0  00000+0 0  9991
2 28874  56.0647 331.0898 0137423 274.4620 304.2640  2.00575977122732
METEOSAT-9 (MSG-2)      
1 28912U 05049B   22178.84662924  .00000131  00000+0  00000+0 0  9994
2 28912   6.0427  66.2484 0001574 350.8987 209.2016  1.00269955 60496
GOES 13                 
1 29155U 06018A   22178.84976909  .00000048  00000+0  00000+0 0  9999
2 29155   0.6271  96.9455 0003570  88.8740  97.2357  1.00270324 28831
GPS BIIR-16M            
1 29601U 06052A   22178.04841405 -.00000023  00000+0  00000+0 0  9991
2 29601  55.5115 271.6195 0083623  74.5402 286.4239  2.00551738114301
GPS BIIR-17M            
1 32260U 07047A   22178.36369560  .00000001  00000+0  00000+0 0  9998
2 32260  53.3178 140.1338 0139838  62.4913 298.8791  2.00574455107711
GPS BIIR-18M            
1 32384U 07062A   22177.83307799 -.00000098  00000+0  00000+0 0  9996
2 32384  56.1842 331.8700 0020779 137.5412 330.2414  2.00562780106406
SARSAT 12 (NOAA 19)     
1 33591U 09005A   22179.11552946  .00000116  00000+0  87913-4 0  9998
2 33591  99.1467 213.4761 0014415 154.4922 205.6963 14.12581570689957
GOES 14                 
1 35491U 09033A   22178.60139601 -.00000082  00000+0  00000+0 0  9992
2 35491   0.3433  95.4130 0012637 116.5077 175.5757  1.00270714 47566
GOES 15                 
1 36411U 10008A   22178.66846256  .00000065  00000+0  00000+0 0  9996
2 36411   0.3160 102.0593 0001926  14.7298 271.1210  1.00271199 45122
GPS BIIF-2              
1 37753U 11036A   22178.47341042 -.00000086  00000+0  00000+0 0  9994
2 37753  56.6109  28.3128 0118147  52.2712 307.4608  2.00565644 80175
GSAT0101 (GALILEO-PFM)  
1 37846U 11060A   22177.05049071 -.00000089  00000+0  00000+0 0  9997
2 37846  57.0001  21.1012 0003760  46.8633 313.2193  1.70475243 66362
GSAT0102 (GALILEO-FM2)  
1 37847U 11060B   22178.86247986 -.00000084  00000+0  00000+0 0  9998
2 37847  57.0014  21.0517 0003187  12.4841  66.3220  1.70475618 66407
LUCH 5A                 
1 37951U 11074B   22178.94257706 -.00000044  00000+0  00000+0 0  9995
2 37951   5.0453  97.4857 0005901 349.4512 335.2703  1.00271887 38645
METEOSAT-10 (MSG-3)     
1 38552U 12035B   22178.83939983  .00000068  00000+0  00000+0 0  9998
2 38552   1.5370  41.7957 0000304 113.6524  71.8577  1.00274719 36312
SARSAT 13 (METOP-B)     
1 38771U 12049A   22179.18564171  .00000049  00000+0  42507-4 0  9990
2 38771  98.6950 238.7795 0001653  70.4462 354.8697 14.21491948507258
GPS BIIF-3              
1 38833U 12053A   22178.45809433  .00000080  00000+0  00000+0 0  9998
2 38833  53.5304 202.9401 0124008  46.1854 314.9003  2.00562017 70345
GSAT0103 (GALILEO-FM3)  
1 38857U 12055A   22178.26308453  .00000020  00000+0  00000+0 0  9995
2 38857  55.1420 141.4296 0005062 271.8835  88.0038  1.70473790 60274
GSAT0104 (GALILEO-FM4)  
1 38858U 12055B   22178.81977313  .00000020  00000+0  00000+0 0  9994
2 38858  55.1422 141.4157 0002600 275.4063  84.5078  1.70474073 60282
GPS BIIF-4              
1 39166U 13023A   22178.31654292 -.00000096  00000+0  00000+0 0  9990
2 39166  55.6915 327.4577 0104018  38.4922 322.2322  2.00565976 66788
INSAT-3D                
1 39216U 13038B   22178.85395556 -.00000148  00000+0  00000+0 0  9994
2 39216   0.0172  71.9198 0000873  67.3392 166.2612  1.00271207 32555
GPS BIIF-5              
1 39533U 14008A   22178.31614260  .00000080  00000+0  00000+0 0  9995
2 39533  53.6240 208.4532 0060275 209.0009 150.7365  2.00554189 60589
LUCH 5V                 
1 39727U 14023A   22179.07170429 -.00000261  00000+0  00000+0 0  9997
2 39727   1.5224  75.6433 0003687  49.2224 271.8192  1.00269629547965
GPS BIIF-6              
1 39741U 14026A   22178.09820864 -.00000087  00000+0  00000+0 0  9998
2 39741  56.5723  27.8531 0026575 307.6545  52.1605  2.00555475 59438
GPS BIIF-7              
1 40105U 14045A   22178.17990957  .00000016  00000+0  00000+0 0  9996
2 40105  54.6953 146.4160 0019718 111.5533 248.6209  2.00547945 56975
GSAT0201 (GALILEO 5)    
1 40128U 14050A   22178.45045328 -.00000123  00000+0  00000+0 0  9991
2 40128  50.2781 331.8839 1627182 124.4068 252.0997  1.85519098 51407
GSAT0202 (GALILEO 6)    
1 40129U 14050B   22176.01641939 -.00000131  00000+0  00000+0 0  9991
2 40129  50.3045 331.0415 1624441 125.1290 251.2236  1.85519670 53522
GPS BIIF-8              
1 40294U 14068A   22178.05867804 -.00000073  00000+0  00000+0 0  9995
2 40294  55.8218  87.5556 0041316  54.7135 305.6802  2.00572300 56101
GLONASS-K 2             
1 40315U 14075A   22178.47852343  .00000054  00000+0  00000+0 0  9993
2 40315  63.6892 240.8191 0018797 210.0007 247.8578  2.13101527 58945
GPS BIIF-9              
1 40534U 15013A   22177.69856993 -.00000012  00000+0  00000+0 0  9992
2 40534  53.6963 264.3134 0068721  20.4639 339.8640  2.00551926 52719
GSAT0203 (GALILEO 7)    
1 40544U 15017A   22178.59086063 -.00000085  00000+0  00000+0 0  9990
2 40544  56.7959  21.0912 0000887 239.3613 120.6813  1.70476088 44476
GSAT0204 (GALILEO 8)    
1 40545U 15017B   22177.08384874 -.00000089  00000+0  00000+0 0  9999
2 40545  56.8011  21.1449 0001208 183.7583 176.2917  1.70475810  7494
GPS BIIF-10             
1 40730U 15033A   22178.36192135 -.00000096  00000+0  00000+0 0  9990
2 40730  55.1896 326.2806 0074174   8.2899 351.8182  2.00551300 50892
METEOSAT-11 (MSG-4)     
1 40732U 15034A   22178.90936082  .00000007  00000+0  00000+0 0  9991
2 40732   0.3086  58.3884 0001729  62.9288 122.2259  1.00279239 25480
GSAT0205 (GALILEO 9)    
1 40889U 15045A   22176.85094949 -.00000014  00000+0  00000+0 0  9994
2 40889  55.6166 261.7326 0003339  10.6330 349.4298  1.70474058 42256
GSAT0206 (GALILEO 10)   
1 40890U 15045B   22178.24491308 -.00000004  00000+0  00000+0 0  9990
2 40890  55.6148 261.6897 0001792 342.7951  17.2643  1.70473984 42306
GPS BIIF-11             
1 41019U 15062A   22178.90430894 -.00000066  00000+0  00000+0 0  9997
2 41019  55.8108  87.3653 0077976 218.1207 141.3387  2.00562845 48745
ELEKTRO-L 2             
1 41105U 15074A   22178.90639542 -.00000110  00000+0  00000+0 0  9997
2 41105   3.0135  88.0165 0002005  46.6309  93.1372  1.00270905 23978
GSAT0209 (GALILEO 12)   
1 41174U 15079A   22179.00567315  .00000019  00000+0  00000+0 0  9995
2 41174  55.1585 141.1127 0005253 307.6252  52.2702  1.70474303 40635
GSAT0208 (GALILEO 11)   
1 41175U 15079B   22178.05196806  .00000020  00000+0  00000+0 0  9995
2 41175  55.1568 141.1375 0004553 306.5958  53.3080  1.70474324 40617
GPS BIIF-12             
1 41328U 16007A   22177.00092676  .00000027  00000+0  00000+0 0  9998
2 41328  54.9123 147.1369 0062093 230.7753 128.6419  2.00570389 46715
GSAT0211 (GALILEO 14)   
1 41549U 16030A   22178.17157531 -.00000004  00000+0  00000+0 0  9996
2 41549  55.7608 261.6260 0003190 310.0749  49.9622  1.70475596 37934
GSAT0210 (GALILEO 13)   
1 41550U 16030B   22178.46420375 -.00000002  00000+0  00000+0 0  9997
2 41550  55.7600 261.6193 0003237 271.7991  88.2310  1.70475627 37932
INSAT-3DR               
1 41752U 16054A   22178.78054251 -.00000069  00000+0  00000+0 0  9991
2 41752   0.1272  99.1245 0010007 171.2443   0.4778  1.00272690 21256
GSAT0207 (GALILEO 15)   
1 41859U 16069A   22178.12564473  .00000020  00000+0  00000+0 0  9991
2 41859  54.8186 141.3156 0005452 295.9711  63.9183  1.70472997 34667
GSAT0212 (GALILEO 16)   
1 41860U 16069B   22178.56563433  .00000019  00000+0  00000+0 0  9994
2 41860  54.8164 141.3012 0004066 314.7861  45.1250  1.70472949 34925
GSAT0213 (GALILEO 17)   
1 41861U 16069C   22178.34445902  .00000019  00000+0  00000+0 0  9991
2 41861  54.8186 141.3125 0005116 278.4548  81.4321  1.70473108 34919
GSAT0214 (GALILEO 18)   
1 41862U 16069D   22178.49153973  .00000019  00000+0  00000+0 0  9992
2 41862  54.8169 141.3029 0004233 282.7582  77.1389  1.70473122 34911
GOES 16                 
1 41866U 16071A   22178.89435962 -.00000240  00000+0  00000+0 0  9991
2 41866   0.0608 237.2411 0000474 278.6857   6.8126  1.00272239 20561
GSAT-17                 
1 42815U 17040B   22179.14323270 -.00000249  00000+0  00000+0 0  9999
2 42815   0.0740 108.3572 0001697 159.6583 153.2598  1.00271890 18335
GSAT0215 (GALILEO 19)   
1 43055U 17079A   22178.39568299 -.00000003  00000+0  00000+0 0  9994
2 43055  55.7361 261.4521 0002772 263.4716  96.5638  1.70474753 28256
GSAT0216 (GALILEO 20)   
1 43056U 17079B   22175.75495984 -.00000021  00000+0  00000+0 0  9992
2 43056  55.7382 261.5245 0004349 270.9622  89.0375  1.70474846 28220
GSAT0217 (GALILEO 21)   
1 43057U 17079C   22178.32155479 -.00000003  00000+0  00000+0 0  9991
2 43057  55.7346 261.4536 0003795 283.3518  76.6723  1.70474864 28251
GSAT0218 (GALILEO 22)   
1 43058U 17079D   22178.54158816 -.00000002  00000+0  00000+0 0  9993
2 43058  55.7346 261.4449 0004901 267.5332  92.4787  1.70474784 28283
GOES 17                 
1 43226U 18022A   22178.09265142  .00000106  00000+0  00000+0 0  9994
2 43226   0.0819 252.4481 0000089 239.4954  39.3909  1.00272365 15876
GSAT0221 (GALILEO 25)   
1 43564U 18060A   22178.44023807 -.00000085  00000+0  00000+0 0  9997
2 43564  57.1780  20.9135 0001598 301.2542  58.7816  1.70475880 24430
GSAT0222 (GALILEO 26)   
1 43565U 18060B   22178.07351933 -.00000086  00000+0  00000+0 0  9992
2 43565  57.1803  20.9240 0001639 327.1208  32.9205  1.70475849 24471
GSAT0219 (GALILEO 23)   
1 43566U 18060C   22177.12089889 -.00000088  00000+0  00000+0 0  9998
2 43566  57.1803  20.9516 0001441 337.7788  22.2660  1.70475857 24431
GSAT0220 (GALILEO 24)   
1 43567U 18060D   22178.51418597 -.00000085  00000+0  00000+0 0  9992
2 43567  57.1807  20.9141 0001324 320.5753  39.4666  1.70475886 24441
BEIDOU-3 M13            
1 43622U 18072A   22178.34640311 -.00000050  00000+0  00000+0 0  9991
2 43622  55.4854 111.0222 0008217 293.2913 196.8328  1.86231756 25638
BEIDOU-3 M14            
1 43623U 18072B   22178.24441042 -.00000050  00000+0  00000+0 0  9991
2 43623  55.4873 111.0172 0006375 313.8418 198.1381  1.86231764 25639
GPS BIII-1              
1 43873U 18109A   22178.39074472  .00000021  00000+0  00000+0 0  9991
2 43873  55.0927 149.5025 0019142 196.3789 342.6411  2.00572091 25971
METEOR-M2 2             
1 44387U 19038A   22179.18565589  .00000017  00000+0  26768-4 0  9995
2 44387  98.7231 139.8787 0000350 182.0777 178.0403 14.23713202154931
GPS BIII-2              
1 44506U 19056A   22178.48803234 -.00000088  00000+0  00000+0 0  9997
2 44506  55.6841  28.6480 0024499 177.6614 332.9286  2.00557701 20976
BEIDOU-3 M23            
1 44542U 19061A   22178.39834156  .00000064  00000+0  00000+0 0  9993
2 44542  54.5809 231.7742 0007957 325.7854  34.2580  1.86231399 18777
BEIDOU-3 M24            
1 44543U 19061B   22179.20034748  .00000063  00000+0  00000+0 0  9993
2 44543  54.5791 231.7162 0005411 311.5372 137.5352  1.86231638 18786
BEIDOU-3 M21            
1 44793U 19078A   22178.51229753 -.00000106  00000+0  10000-3 0  9997
2 44793  54.9697 350.2707 0006782  21.8142 159.1993  1.86232179 17637
BEIDOU-3 M22            
1 44794U 19078B   22178.48883709 -.00000106  00000+0  00000+0 0  9996
2 44794  54.9440 350.2624 0004700  22.7723  54.2004  1.86232723 17638
ELEKTRO-L 3             
1 44903U 19095A   22178.85273451 -.00000088  00000+0  00000+0 0  9994
2 44903   0.0756 229.4665 0001271 244.0909 185.3977  1.00272024  9178
GPS BIII-3              
1 45854U 20041A   22179.11523566 -.00000065  00000+0  00000+0 0  9993
2 45854  55.5293  85.8941 0022594 177.1165   2.5509  2.00559167 14946
GPS BIII-4              
1 46826U 20078A   22178.52808925 -.00000015  00000+0  00000+0 0  9997
2 46826  54.5592 269.6878 0020727 187.5229 263.4384  2.00565196 12418
GSAT0223 (GALILEO 27)   
1 49809U 21116A   22178.47816645 -.00000085  00000+0  00000+0 0  9994
2 49809  57.1725  20.8133 0002168 129.2303 298.7087  1.70476056  3441
GSAT0224 (GALILEO 28)   
1 49810U 21116B   22179.01477369 -.00000083  00000+0  00000+0 0  9991
2 49810  57.1740  20.7969 0002197 111.0005  38.7468  1.70476020  3475
"
