"MOLNIYA 2-9             
1 07276U 74026A   22151.26604821  .00000115  00000+0  00000+0 0  9996
2 07276  64.2697 229.5520 6492127 281.5798  16.8337  2.45097356248793
MOLNIYA 2-10            
1 07376U 74056A   22148.53299212  .00001231  00000+0  00000+0 0  9990
2 07376  64.0786  96.8724 6719714 286.9762  13.5329  2.01133448349956
MOLNIYA 1-S             
1 07392U 74060A   22151.66605455 -.00000200  00000+0  00000+0 0  9997
2 07392   5.1580 283.2459 0011368 202.7471  92.6361  1.00206963119350
MOLNIYA 1-29            
1 07780U 75036A   22151.23771887  .00000222  00000+0 -60648-1 0  9998
2 07780  63.3899 217.1614 6937349 288.9986  11.8073  2.00629425345276
MOLNIYA 2-14            
1 08195U 75081A   22148.38778339  .00000932  00000+0  00000+0 0  9991
2 08195  63.3748 190.1457 6834229 293.2380  11.3025  2.02057970342489
MOLNIYA 1-32            
1 08601U 76006A   22146.03561642  .00001120  00000+0  73085-2 0  9994
2 08601  63.4150 300.7358 7282150 283.6315  10.8164  1.99961794 52210
MOLNIYA 1-36            
1 09880U 77021A   22147.99292376  .00001392  00000+0  13793-1 0  9993
2 09880  63.3852 271.4074 7218916 289.6627   9.9116  2.00721585229046
MOLNIYA 3-8             
1 10455U 77105A   22145.70694536  .00001188  00000+0  19193-2 0  9991
2 10455  63.2739   1.4675 7384992 282.0772  10.5738  2.00730941326685
MOLNIYA 1-40            
1 10925U 78055A   22150.80351759  .00000676  00000+0  00000+0 0  9997
2 10925  63.2109  50.7769 7255145 280.5276  11.8513  2.00588314322325
MOLNIYA 3-10            
1 11057U 78095A   22151.75411493 -.00000018  00000+0  71542-4 0  9990
2 11057  63.0887  45.4489 5801842 310.0507  11.9726  4.09855010383042
MOLNIYA 3-13            
1 11896U 80063A   22150.03555363  .00000569  00000+0  00000+0 0  9990
2 11896  62.6646 139.8345 7079126 276.2384  14.2560  2.00611871306726
MOLNIYA 1-49            
1 12156U 81009A   22151.18401553  .00000381  00000+0  87842-3 0  9994
2 12156  61.7102 168.2211 7239909 261.9702  17.9673  2.05707195221139
MOLNIYA 1-52            
1 13012U 81123A   22151.31129151 -.00001334  00000+0 -32983-2 0  9995
2 13012  61.9066 281.5216 7259266 254.4462  21.2464  2.00579309296232
MOLNIYA 1-53            
1 13070U 82015A   22151.73541539  .00000229  00000+0 -30369-1 0  9990
2 13070  62.6458 216.3341 7073141 282.6509  12.5930  2.00883499294928
MOLNIYA 3-20            
1 13875U 83015A   22150.57701086 -.00000859  00000+0 -85973-3 0  9993
2 13875  62.8183 355.6510 7400306 257.9011  18.0341  2.00418241223358
MOLNIYA 1-56            
1 13890U 83019A   22150.67710868  .00000079  00000+0  26816-4 0  9997
2 13890  62.9858  21.0652 7441711 263.9146  15.3071  1.99831101286245
MOLNIYA 1-62            
1 15214U 84089A   22150.90102190  .00043637  22035-5  27673-3 0  9992
2 15214  62.8813  19.4371 7520528 271.2908  12.3704  2.03636707243949
MOLNIYA 1-63            
1 15429U 84124A   22148.73409076  .00001348  00000+0  00000+0 0  9997
2 15429  63.7112 169.6863 6609091 259.9779  31.1540  2.00622894274360
MOLNIYA 3-24            
1 15738U 85040A   22150.94830338 -.00000083  00000+0  00000+0 0  9999
2 15738  63.7015  86.0268 6788962 247.4264  30.8519  2.55628481303422
MOLNIYA 3-27            
1 16393U 85117A   22151.27716745 -.00000099  00000+0  00000+0 0  9991
2 16393  64.4417  83.7860 6957566 248.7410  27.8653  2.12398299273819
MOLNIYA 1-69            
1 17078U 86089A   22145.47198076 -.00000471  00000+0  00000+0 0  9991
2 17078  64.0067 188.7767 6624406 258.5811  25.6533  2.00742984260367
MOLNIYA 3-31            
1 17328U 87008A   22150.99793375  .00000293  00000+0  00000+0 0  9998
2 17328  63.7138 130.8160 6998992 254.1632  24.1187  2.00551277255515
MOLNIYA 1-71            
1 18946U 88017A   22150.97774140  .00000195  00000+0  00000+0 0  9994
2 18946  63.4468 125.5990 7114140 256.6054  21.6119  2.00667662250707
MOLNIYA 1-75            
1 19807U 89014A   22146.17144109  .00000124  00000+0  00000+0 0  9994
2 19807  64.0998 287.1191 6884926 267.2562  18.9506  2.00563608243553
MOLNIYA 1-80            
1 21118U 91012A   22150.59991526 -.00000643  00000+0  00000+0 0  9994
2 21118  65.1840 334.8890 6807900 277.9387  15.5474  2.05246907230610
MOLNIYA 3-40            
1 21196U 91022A   22149.61767479  .00000284  00000+0  00000+0 0  9990
2 21196  65.1245 328.5552 6839229 274.7033  16.4161  2.03017309229309
MOLNIYA 1-81            
1 21426U 91043A   22151.58890945 -.00000061  00000+0  00000+0 0  9997
2 21426  64.1447 346.2104 7106048 267.1883  16.9941  2.00617734226824
MOLNIYA 3-41            
1 21706U 91065A   22151.27663494  .00001251  00000+0  00000+0 0  9996
2 21706  64.1087 167.9080 6807096 256.1693  25.0646  2.04344740226510
MOLNIYA 3-42            
1 22178U 92067A   22150.19733170  .00000178  00000+0  00000+0 0  9999
2 22178  64.6734 217.8605 6441045 267.4159  22.9549  2.20435605 79654
MOLNIYA 1-86            
1 22671U 93035A   22152.17581513  .00000034  00000+0  72122-4 0  9995
2 22671  63.0816 246.4314 4848511   6.7247 357.9880  5.62664111351332
MOLNIYA 1-87            
1 22949U 93079A   22151.29966848 -.00001127  00000+0  00000+0 0  9997
2 22949  63.8842  94.2231 6859660 284.5538  13.3452  2.02873426 74581
MOLNIYA 1-88            
1 23420U 94081A   22151.75321458  .00000101  00000+0  00000+0 0  9999
2 23420  64.2792 199.3743 5817475 283.4120  21.0450  3.34498360246381
MOLNIYA 3-47            
1 23642U 95042A   22148.46681883  .00001219  00000+0  00000+0 0  9999
2 23642  63.9712  76.5229 6914199 284.8083  12.9423  2.01954915196610
MOLNIYA 1-90            
1 24960U 97054A   22150.83586104  .00000098  00000+0 -99640-3 0  9999
2 24960  63.6379 166.6282 6130214 298.9035  13.5400  3.18690010207449
MOLNIYA 1-91            
1 25485U 98054A   22151.92034051  .00000177  00000+0  22925-2 0  9991
2 25485  63.0087 152.7354 6782524 291.9030  12.3503  2.36445513177995
MOLNIYA 3-50            
1 25847U 99036A   22143.09556037  .00000121  00000+0  22472-3 0  9993
2 25847  63.1379 338.3572 7403613 281.7609  10.5117  2.00605474167608
"
