"SCD 1                   
1 22490U 93009B   17170.60623937  .00000216  00000-0  94922-5 0  9990
2 22490  24.9704 288.9225 0043060   0.7057 108.1130 14.44488376285674
TECHSAT 1B (GO-32)      
1 25397U 98043D   17170.44394547 -.00000026  00000-0  75370-5 0  9992
2 25397  98.6101 112.7330 0001701  38.3436 321.7863 14.23623594983892
SCD 2                   
1 25504U 98060A   17170.29044116  .00000218  00000-0  10597-4 0  9999
2 25504  24.9946 134.0211 0017336  32.1736 112.8395 14.44009537984980
LANDSAT 7               
1 25682U 99020A   17170.25458560  .00000041  00000-0  19197-4 0  9990
2 25682  98.2092 241.3872 0000999  74.0708 286.0610 14.57109104966898
DLR-TUBSAT              
1 25757U 99029B   17170.56876277 -.00000108  00000-0 -15475-4 0  9996
2 25757  98.4136  82.4902 0013400 295.8244  64.1569 14.51360125956814
QUIKSCAT                
1 25789U 99034A   17170.56703320  .00000002  00000-0  18484-4 0  9999
2 25789  98.6061 359.1471 0001783  64.3733 295.7632 14.27278865937539
TERRA                   
1 25994U 99068A   17170.40231576  .00000125  00000-0  37772-4 0  9993
2 25994  98.2062 245.4162 0001192  78.7756 281.3575 14.57113306930997
MAROC-TUBSAT            
1 27004U 01056D   17170.47658479 -.00000028  00000-0  17885-4 0  9995
2 27004  99.3572 310.2535 0019392 333.0374  68.1467 13.70123117776363
AQUA                    
1 27424U 02022A   17170.58962521  .00000087  00000-0  29363-4 0  9991
2 27424  98.2045 111.8448 0002805  93.0777  68.1337 14.57121931804570
IRS-P6 (RESOURCESAT-1)  
1 28051U 03046A   17170.45203974  .00000022  00000-0  29677-4 0  9998
2 28051  98.6235 246.0832 0003461 344.7087  15.3986 14.21672705709602
TANSUO 1 (TS 1)         
1 28220U 04012A   17170.50764689  .00000400  00000-0  37679-4 0  9992
2 28220  97.6997 126.5631 0011386 124.9664 235.2630 14.99213889716771
FORMOSAT-2 (ROCSAT 2)   
1 28254U 04018A   17170.54143951  .00000178  00000-0  14830-3 0  9997
2 28254  98.8593 230.0936 0001288 114.5091  19.4574 14.00625035668925
AURA                    
1 28376U 04026A   17170.56445108  .00000095  00000-0  31180-4 0  9998
2 28376  98.2037 113.9907 0002058  80.6477 279.4954 14.57122790687621
IRS-P5 (CARTOSAT-1)     
1 28649U 05017A   17170.51656743 -.00000930  00000-0 -10685-3 0  9992
2 28649  97.8603 244.8845 0003303  54.5569 305.5963 14.83442485656328
SINAH 1                 
1 28893U 05043D   17170.48318913  .00000012  00000-0  11330-4 0  9990
2 28893  97.8749 328.4834 0016171 141.7353 218.5000 14.61435954620532
EROS B                  
1 29079U 06014A   17170.58541844  .00003054  00000-0  10385-3 0  9995
2 29079  97.3526 291.0238 0005835  75.3933 340.7684 15.31199463618714
RESURS-DK 1             
1 29228U 06021A   17170.57157248  .00000098  00000-0  14857-4 0  9993
2 29228  69.9362  92.0132 0006476 311.7561  48.3045 15.02162335608459
ARIRANG-2 (KOMPSAT-2)   
1 29268U 06031A   17170.50624220  .00000057  00000-0  20512-4 0  9990
2 29268  98.1004  69.6741 0018104   1.5623 358.5636 14.62264230581331
LAPAN-TUBSAT            
1 29709U 07001A   17170.42166354  .00000046  00000-0  12158-4 0  9993
2 29709  97.7042 145.1483 0014468  84.9232 275.3641 14.82059594564319
CARTOSAT-2 (IRS-P7)     
1 29710U 07001B   17170.42102247  .00000325  00000-0  51296-4 0  9992
2 29710  97.9243 231.4296 0002204 116.4217 243.7220 14.78670192563528
HAIYANG-1B              
1 31113U 07010A   17170.44954398  .00000008  00000-0  20055-4 0  9993
2 31113  98.5578 225.4714 0013399 193.6143 166.4685 14.30173536531794
COSMO-SKYMED 1          
1 31598U 07023A   17170.46886155  .00000078  00000-0  16361-4 0  9993
2 31598  97.8848 354.1420 0001293  81.6391 278.5012 14.82160033542783
TERRASAR-X              
1 31698U 07026A   17170.53841146  .00000012  00000-0  37466-5 0  9994
2 31698  97.4460 178.1663 0001823  90.2757 269.8686 15.19152827200104
WORLDVIEW-1 (WV-1)      
1 32060U 07041A   17170.49591697  .00000856  00000-0  37631-4 0  9992
2 32060  97.3865 290.4686 0002408  90.6226 322.9480 15.24554130542600
YAOGAN 3                
1 32289U 07055A   17170.47077468 -.00000035  00000-0  23340-5 0  9996
2 32289  97.9996 172.4155 0001184  68.6653 291.4679 14.80817328519070
COSMO-SKYMED 2          
1 32376U 07059A   17170.50262012  .00000054  00000-0  13359-4 0  9990
2 32376  97.8845 354.1750 0001490  86.2913 273.8469 14.82158555515534
RADARSAT-2              
1 32382U 07061A   17170.49732888  .00000062  00000-0  41132-4 0  9990
2 32382  98.5758 178.0675 0001290  86.6068  65.6758 14.29984020496625
CARTOSAT-2A             
1 32783U 08021A   17170.46608417  .00000056  00000-0  14741-4 0  9998
2 32783  97.9266 231.5537 0012104 314.9364  45.0886 14.78688997493473
JASON 2 (OSTM)          
1 33105U 08032A   17170.62983796 -.00000062  00000-0 -20527-5 0  9992
2 33105  66.0413 116.5578 0008291 270.6404  95.7962 12.80930402420856
RAPIDEYE 2              
1 33312U 08040A   17170.43714753  .00000011  00000-0  82225-5 0  9990
2 33312  97.8175 251.3409 0013009 351.3539   8.7445 14.79921665475708
RAPIDEYE 5              
1 33313U 08040B   17170.46022366  .00000066  00000-0  15581-4 0  9996
2 33313  97.8299 249.3380 0015467 215.1939 144.8254 14.79917135475653
RAPIDEYE 1              
1 33314U 08040C   17170.44844144  .00000026  00000-0  10306-4 0  9997
2 33314  97.8196 250.9773 0024737   0.7778 359.3469 14.79923506475697
RAPIDEYE 3              
1 33315U 08040D   17170.48483997  .00000030  00000-0  10780-4 0  9998
2 33315  97.8328 249.0351 0010942 301.3781  58.6356 14.79924598475666
RAPIDEYE 4              
1 33316U 08040E   17170.47164262  .00000062  00000-0  15060-4 0  9990
2 33316  97.8363 248.5936 0009688 237.8022 122.2251 14.79920020475652
HUANJING 1A (HJ-1A)     
1 33320U 08041A   17170.41526972  .00000106  00000-0  22406-4 0  9991
2 33320  97.9350 235.1276 0026845  21.4225 338.8106 14.76790765473110
HUANJING 1B (HJ-1B)     
1 33321U 08041B   17170.42131242  .00000118  00000-0  24063-4 0  9999
2 33321  97.9403 236.3430 0035716  36.3967 323.9664 14.76867158473104
GEOEYE 1                
1 33331U 08042A   17170.31094292  .00000032  00000-0  15117-4 0  9997
2 33331  98.1093 245.4696 0008704 258.4974 101.5258 14.64156343469412
THEOS                   
1 33396U 08049A   17170.49594737  .00000170  00000-0  10000-3 0  9991
2 33396  98.6766 237.6569 0001348  94.2294  30.9389 14.20055679451801
COSMO-SKYMED 3          
1 33412U 08054A   17170.48996435  .00000343  00000-0  49589-4 0  9993
2 33412  97.8847 354.1624 0001457  87.0842 273.0545 14.82155809467993
YAOGAN 4                
1 33446U 08061A   17170.55120365  .00000078  00000-0  17923-4 0  9999
2 33446  97.5936 167.4391 0014516 296.4850  63.4872 14.76666324460378
GOSAT (IBUKI)           
1 33492U 09002A   17170.54852991  .00000002  00000-0  89300-5 0  9998
2 33492  98.1230 282.1621 0001139  81.3596 278.7730 14.67522222450178
YAOGAN 6                
1 34839U 09021A   17170.56338248  .00000598  00000-0  25995-4 0  9990
2 34839  97.1438 221.0316 0027504 315.3017  44.6004 15.25657114452921
DEIMOS-1                
1 35681U 09041A   17170.51346801 -.00000079  00000-0 -49143-5 0  9995
2 35681  97.9524  62.7499 0001161  22.6620 337.4628 14.71662545423480
DUBAISAT-1              
1 35682U 09041B   17170.53853536  .00000114  00000-0  27567-4 0  9999
2 35682  97.7982  30.9598 0012365 140.5730 219.6388 14.68584953422557
OCEANSAT 2              
1 35931U 09051A   17170.37364076  .00000055  00000-0  25241-4 0  9996
2 35931  98.3093 264.9295 0002768 152.6820 207.4521 14.50834884409671
WORLDVIEW-2 (WV-2)      
1 35946U 09055A   17170.31037353 -.00000040  00000-0  12267-5 0  9995
2 35946  98.5037 246.5751 0001902  57.1451 302.9922 14.37765500403817
SMOS                    
1 36036U 09059A   17170.58773562  .00000093  00000-0  43594-4 0  9991
2 36036  98.4451 358.2490 0001294  87.4632 272.6704 14.39745497400823
YAOGAN 7                
1 36110U 09069A   17170.42918728 -.00000459  00000-0 -59807-4 0  9995
2 36110  98.2145 329.3089 0025751 105.5665 254.8390 14.75080276405217
TANDEM-X                
1 36605U 10030A   17170.40667405  .00000151  00000-0  10366-4 0  9999
2 36605  97.4461 178.0391 0001378  90.0808 270.0584 15.19152943200082
CARTOSAT 2B             
1 36795U 10035A   17170.43562439 -.00001847  00000-0 -24454-3 0  9995
2 36795  97.9233 231.3638 0015334  28.5974 331.6069 14.78664875374516
YAOGAN 10               
1 36834U 10038A   17170.49367552  .00000048  00000-0  13017-4 0  9991
2 36834  97.9324 166.9030 0001163  62.7675 297.3664 14.80827485370823
COSMO-SKYMED 4          
1 37216U 10060A   17170.51948985 -.00000002  00000-0  63354-5 0  9990
2 37216  97.8840 354.1914 0001331  72.6306 287.5064 14.82160915358089
HAIYANG 2A              
1 37781U 11043A   17170.54804627  .00000986  00000-0  10134-2 0  9991
2 37781  99.3297 181.6359 0001184  41.5748 318.5484 13.78716595294306
RASAT                   
1 37791U 11044D   17170.45309317  .00000012  00000-0  11305-4 0  9992
2 37791  98.1355 262.3389 0023140 112.4773 247.8888 14.64606287312104
MEGHA-TROPIQUES         
1 37838U 11058A   17170.31110958  .00000279  00000-0  89799-5 0  9993
2 37838  19.9765 133.6633 0009790  86.2152 273.9371 14.09682663226166
SRMSAT                  
1 37841U 11058D   17170.20063494  .00000285  00000-0  11214-4 0  9990
2 37841  19.9714 119.9917 0012011 103.5779  26.1416 14.10576656293476
YAOGAN 13               
1 37941U 11072A   17170.56215942  .00000683  00000-0  36629-4 0  9992
2 37941  97.4856  98.5078 0000854  61.6894  46.0626 15.18293450308028
PLEIADES 1A             
1 38012U 11076F   17170.53836417  .00000018  00000-0  13788-4 0  9992
2 38012  98.1980 245.6825 0001201  76.2780 283.8552 14.58559145293203
ZIYUAN 1-02C (ZY 1-02C) 
1 38038U 11079A   17170.43413544  .00000046  00000-0  30595-4 0  9990
2 38038  98.3424 234.2906 0001808  92.1196 268.0201 14.35446393287823
ZIYUAN 3 (ZY 3)         
1 38046U 12001A   17170.56129950  .00000823  00000-0  40018-4 0  9998
2 38046  97.5354 237.6141 0003630  62.4740  74.8383 15.21228794302318
RISAT 1                 
1 38248U 12017A   17170.54735089  .00000493  00000-0  35080-4 0  9999
2 38248  97.5732 178.1848 0005676  48.3905  50.7138 15.09101016283595
ARIRANG-3 (KOMPSAT-3)   
1 38338U 12025B   17170.39482406  .00000048  00000-0  19175-4 0  9996
2 38338  98.1395 108.5174 0009713 331.4567  28.6093 14.61572621271505
KANOPUS-V 1             
1 38707U 12039A   17170.52806166 -.00001043  00000-0 -45053-4 0  9991
2 38707  97.4520  88.5373 0002080  80.5832  25.7160 15.20187109272415
EXACTVIEW-1 (ADS-1B)    
1 38709U 12039C   17170.44670675 -.00000008  00000-0  17359-4 0  9995
2 38709  99.0983 147.0231 0009969 244.7268 115.2879 14.23944454255152
SPOT 6                  
1 38755U 12047A   17170.48516293  .00000009  00000-0  11817-4 0  9997
2 38755  98.2186 237.8200 0001421  84.9488 275.1876 14.58546291254276
PLEIADES 1B             
1 39019U 12068A   17170.50431262  .00000022  00000-0  14580-4 0  9994
2 39019  98.2010 245.6753 0001308  78.5375 281.5971 14.58556097242059
GOKTURK 2               
1 39030U 12073A   17170.56660729  .00000030  00000-0  12412-4 0  9992
2 39030  97.9945  63.3626 0002770  66.3332 293.8170 14.72648463240905
LANDSAT 8               
1 39084U 13008A   17170.28690484  .00000043  00000-0  19704-4 0  9995
2 39084  98.2232 240.7099 0001318 100.6178 259.5169 14.57106311219535
SARAL                   
1 39086U 13009A   17170.61773219 -.00000005  00000-0  14391-4 0  9999
2 39086  98.5405 358.1779 0000590 150.2186 209.9031 14.32004083225453
GAOFEN 1                
1 39150U 13018A   17170.48670402  .00000068  00000-0  17115-4 0  9991
2 39150  97.9512 254.1702 0020169  51.3789 308.9224 14.76502770223582
VNREDSAT 1              
1 39160U 13021B   17170.44827210  .00000068  00000-0  22221-4 0  9997
2 39160  98.0812 246.1849 0001206  82.2352 277.8990 14.62968323219934
ARIRANG-5 (KOMPSAT-5)   
1 39227U 13042A   17170.53029613 -.00000865  00000-0 -57498-4 0  9996
2 39227  97.6092 355.4802 0001885  90.7146 353.7370 15.04512560210048
YAOGAN 18               
1 39363U 13059A   17170.51575907  .00000882  00000-0  46380-4 0  9990
2 39363  97.3908 238.9438 0001367 111.7758   2.2489 15.18175362201676
SKYSAT-1                
1 39418U 13066C   17170.28251415 -.00000499  00000-0 -36588-4 0  9993
2 39418  97.6995 253.4037 0020981 280.2058  79.6821 14.98465613195398
DUBAISAT-2              
1 39419U 13066D   17170.47026238 -.00000284  00000-0 -21506-4 0  9994
2 39419  97.6774 243.1391 0012464 261.5664  98.4154 14.93631842194846
GPM-CORE                
1 39574U 14009C   17170.56308833  .00004068  00000-0  61932-4 0  9997
2 39574  65.0095 271.7242 0012092 288.7645  71.2189 15.56127283187884
SENTINEL-1A             
1 39634U 14016A   17170.52158395 -.00000088  00000-0 -89292-5 0  9994
2 39634  98.1819 178.1270 0001334  76.8044 283.3304 14.59197290171031
KAZEOSAT 1              
1 39731U 14024A   17169.18280847 -.00000043  00000-0  50238-7 0  9999
2 39731  98.4184 248.2703 0001189  75.3133 284.8329 14.42009981165035
ALOS-2                  
1 39766U 14029A   17170.48211449 -.00000202  00000-0 -20115-4 0  9995
2 39766  97.9227 267.7731 0001668  83.8637 276.2733 14.79470032165940
KAZEOSAT 2              
1 40010U 14033A   17170.42194512  .00000034  00000-0  10986-4 0  9995
2 40010  97.8953  72.0888 0015467 270.5185  89.4245 14.82105248162277
HODOYOSHI-4             
1 40011U 14033B   17170.52016506  .00000093  00000-0  18940-4 0  9996
2 40011  97.8864  68.7214 0025419 263.8786  95.9519 14.80875833162104
DEIMOS-2                
1 40013U 14033D   17170.46829291 -.00000197  00000-0 -16907-4 0  9992
2 40013  97.8845  74.4897 0001423  34.1525 325.9772 14.84853064162546
HODOYOSHI-3             
1 40015U 14033F   17170.27667327  .00000213  00000-0  36274-4 0  9999
2 40015  97.8750  63.4134 0035639 270.0958  89.6169 14.78250678161764
SPOT 7                  
1 40053U 14034A   17170.58732769 -.00000045  00000-0  00000-0 0  9997
2 40053  98.1532 237.6372 0001682  87.4341 272.7052 14.58578241158224
SKYSAT-2                
1 40072U 14037D   17170.49628346  .00000095  00000-0  19666-4 0  9992
2 40072  98.3373 281.7094 0007656  46.0712 314.1134 14.80989594159327
WORLDVIEW-3 (WV-3)      
1 40115U 14048A   17170.27914615  .00000121  00000-0  20500-4 0  9994
2 40115  97.8684 250.4640 0000843  53.6620 306.4661 14.84844530154415
YAOGAN 21               
1 40143U 14053A   17170.55942969  .00001030  00000-0  44458-4 0  9993
2 40143  97.3104 243.5673 0009988 175.1355 297.6567 15.24694147154767
YAOGAN 22               
1 40275U 14063A   17170.49426387 -.00000044  00000-0  00000-0 0  9990
2 40275 100.4117 283.7706 0006695  71.8436 288.3411 13.15320074127948
ASNARO                  
1 40298U 14070A   17170.52532780  .00001146  00000-0  57011-4 0  9993
2 40298  97.4079 252.4501 0001926  96.8128  27.9168 15.19588059145219
HODOYOSHI-1             
1 40299U 14070B   17170.56139755  .00000767  00000-0  36295-4 0  9992
2 40299  97.4029 253.2642 0015075  84.1322  29.0476 15.22257712145304
CHUBUSAT-1              
1 40300U 14070C   17170.53103763  .00000922  00000-0  44634-4 0  9991
2 40300  97.3952 250.3832 0022360  92.7110  34.6996 15.20858417145143
QSAT-EOS                
1 40301U 14070D   17170.56690035  .00001897  00000-0  82295-4 0  9995
2 40301  97.3887 250.4767 0029472  89.0830  22.7774 15.23193312145194
TSUBAME                 
1 40302U 14070E   17170.51645929  .00001244  00000-0  66165-4 0  9997
2 40302  97.3761 242.5239 0041506 113.1483 304.6047 15.16365446144709
YAOGAN 23               
1 40305U 14071A   17170.53477505  .00000796  00000-0  42179-4 0  9996
2 40305  97.4271 108.4829 0001098  95.1453  23.5203 15.18194468143786
YAOGAN 24               
1 40310U 14072A   17170.51785714  .00000094  00000-0  20642-4 0  9997
2 40310  98.0030 290.7497 0018527  64.7002 295.6127 14.77118560139061
CBERS-4                 
1 40336U 14079A   17170.44002187 -.00000003  00000-0  13855-4 0  9999
2 40336  98.4529 245.0798 0001710  83.0015 277.1367 14.35467455132739
RESURS P2               
1 40360U 14087A   17170.53815972  .00001835  00000-0  62109-4 0  9998
2 40360  97.2754 264.1980 0011759 133.6774  45.2059 15.31810947138740
YAOGAN 26               
1 40362U 14088A   17170.53210909  .00001207  00000-0  49071-4 0  9996
2 40362  97.3542 249.3940 0006282 274.6006 210.5956 15.26444077138113
SMAP                    
1 40376U 15003A   17170.43959158  .00000031  00000-0  15053-4 0  9991
2 40376  98.1213 178.1136 0001168 108.6685 251.4647 14.63360619127225
KOMPSAT 3A              
1 40536U 15014A   17170.53924593  .00000238  00000-0  17511-4 0  9997
2 40536  97.4810 110.2488 0009988 340.0908 107.1992 15.12201532123402
SENTINEL-2A             
1 40697U 15028A   17170.48722785  .00000012  00000-0  21300-4 0  9994
2 40697  98.5670 245.4202 0001296  76.8646 283.2680 14.30820981104029
CARBONITE 1 (CBNT-1)    
1 40718U 15032D   17170.52502319  .00000038  00000-0  13352-4 0  9993
2 40718  97.9695  62.5318 0017821 127.9791 232.3028 14.74527713104597
YAOGAN 27               
1 40878U 15040A   17170.50692248 -.00000044  00000-0  00000-0 0  9998
2 40878 100.3949 231.2120 0008217 201.8008 158.2757 13.15954880 87120
LAPAN-A2                
1 40931U 15052B   17170.33845318  .00000688  00000-0  67700-5 0  9998
2 40931   5.9997 217.4088 0013266 277.0383  82.8258 14.76531079 93284
YAOGAN 28               
1 41026U 15064A   17170.53706196  .00001252  00000-0  45500-4 0  9990
2 41026  97.3162 298.3504 0008264 324.1518  98.7477 15.30118278 90117
YAOGAN 29               
1 41038U 15069A   17170.56023815 -.00000011  00000-0  53340-5 0  9996
2 41038  97.8986 152.7673 0001069  94.4951 265.6372 14.80392510 84437
KENT RIDGE 1            
1 41167U 15077B   17170.35826389  .00000892  00000-0  14688-4 0  9999
2 41167  14.9770 164.9496 0011842  24.1506 199.5385 15.08701198 83261
TELEOS 1                
1 41169U 15077D   17170.21264152  .00000987  00000-0  19929-4 0  9998
2 41169  14.9772 163.8583 0011446  21.1446  73.8079 15.09376118 83265
JASON-3                 
1 41240U 16002A   17170.58693610 -.00000062  00000-0 -35107-5 0  9995
2 41240  66.0412 117.1620 0008302 271.7912  88.2152 12.80929641 66451
SENTINEL-3A             
1 41335U 16011A   17170.54355402 -.00000013  00000-0  12856-4 0  9990
2 41335  98.6244 237.9628 0001429  97.5416 262.5926 14.26738144 69698
SENTINEL-1B             
1 41456U 16025A   17170.41823977 -.00000020  00000-0  55315-5 0  9998
2 41456  98.1818 177.8498 0001400  78.3639 281.7724 14.59198063 61185
ZIYUAN 3-2              
1 41556U 16033A   17170.61989104  .00000767  00000-0  37398-4 0  9992
2 41556  97.4620 247.3813 0001950 108.7717  20.3751 15.21274453 58617
NUSAT 1 (FRESCO)        
1 41557U 16033B   17170.30727516  .00001488  00000-0  58777-4 0  9991
2 41557  97.4632 249.8242 0014367   7.2088 352.9355 15.27049912 58759
NUSAT 2 (BATATA)        
1 41558U 16033C   17170.53703286  .00001414  00000-0  56225-4 0  9990
2 41558  97.4659 250.1078 0013788   5.3547 354.7836 15.26921301 58783
CARTOSAT-2C             
1 41599U 16040A   17170.51316972  .00000628  00000-0  32953-4 0  9991
2 41599  97.4581 232.2459 0015780  70.0834  41.7124 15.19266749 55003
SKYSAT-C1               
1 41601U 16040C   17170.62257567  .00000790  00000-0  37518-4 0  9993
2 41601  97.5690 235.9980 0001696  29.5834 330.5500 15.22225504 55115
LAPAN-A3                
1 41603U 16040E   17170.62440053  .00000324  00000-0  18545-4 0  9991
2 41603  97.4605 232.5806 0015257  67.8148  88.2198 15.19353228 55024
BIROS                   
1 41604U 16040F   17170.56038422  .00000639  00000-0  32151-4 0  9996
2 41604  97.4618 232.9169 0014161  64.1547 296.1147 15.20742941 55043
3CAT-2                  
1 41732U 16051B   17170.55383278  .00001170  00000-0  49867-4 0  9994
2 41732  97.3763  87.5086 0012076 266.1829 218.8343 15.24883999 46892
SKYSAT-C4               
1 41771U 16058B   17170.42080665  .00000661  00000-0  31428-4 0  9992
2 41771  97.3945 243.3233 0001448  48.8430 311.2929 15.22586590 42021
SKYSAT-C5               
1 41772U 16058C   17170.62996841  .00000730  00000-0  34719-4 0  9990
2 41772  97.3937 243.3265 0003084 101.9315 258.2272 15.22287500 42041
SKYSAT-C2               
1 41773U 16058D   17168.09362116  .00002229  00000-0  10000-3 0  9992
2 41773  97.3939 241.0989 0001475  64.3528 295.5417 15.22233272 41661
SKYSAT-C3               
1 41774U 16058E   17170.27553519  .00000668  00000-0  32048-4 0  9997
2 41774  97.3940 243.2138 0001825  60.0325 300.1092 15.22220302 41999
PATHFINDER 1            
1 41787U 16059E   17170.29444278  .00000081  00000-0  24849-4 0  9994
2 41787  98.1652 231.9274 0030644 151.0730 209.2179 14.63519387 38897
WORLDVIEW-4             
1 41848U 16067A   17170.56186329  .00000071  00000-0  14720-4 0  9997
2 41848  97.9467 244.5624 0002814  68.5990 291.5524 14.84745940 32614
GOKTURK 1A              
1 41875U 16073A   17170.55783781 -.00001117  00000-0 -21055-3 0  9990
2 41875  98.1539  65.4190 0002009  45.5722 314.5685 14.62649680 28641
RESOURCESAT-2A          
1 41877U 16074A   17170.52177403  .00000019  00000-0  28583-4 0  9990
2 41877  98.7068 246.0376 0000943  61.9383 298.1892 14.21634945 27615
ZHUHAI-1 01             
1 42759U 17034B   17170.56677817 -.00000219  00000-0  00000-0 0  9998
2 42759  43.0177 273.4179 0007938 352.9462 129.2400 15.08894962   664
NUSAT-3C                
1 42760U 17034C   17170.58188657  .00000442  00000-0  41421-4 0  9994
2 42760  43.0171 273.3456 0006823 359.6164 200.9062 15.08659584   673
ZHUHAI-1 02             
1 42761U 17034D   17170.62798825 -.00000219  00000-0  00000-0 0  9991
2 42761  43.0197 273.0790 0008343 355.8240 100.4162 15.08967877   663
"
