\contentsline {table}{\numberline {1}{\ignorespaces Earth-flat plate view factor\relax }}{12}{table.caption.11}% 
\contentsline {table}{\numberline {2}{\ignorespaces Unit and integration tests run time.\relax }}{22}{table.caption.27}% 
\contentsline {table}{\numberline {3}{\ignorespaces Fatal bugs analysis and solution\relax }}{25}{table.caption.32}% 
\contentsline {table}{\numberline {4}{\ignorespaces Major bugs analysis and solution\relax }}{26}{table.caption.33}% 
\contentsline {table}{\numberline {5}{\ignorespaces Minor bugs analysis and solution\relax }}{27}{table.caption.34}% 
