
ff: parsing domain file
domain 'FARMBOT' defined
 ... done.
ff: parsing problem file
problem 'MOTIONANDPICTURE' defined
 ... done.



ff: search configuration is weighted A* with weight 5.
Metric is ((1.00*[RF0](TOTAL-COST)) - () + 0.00)
COST MINIMIZATION DONE (WITH cost-minimizing relaxed plans).

advancing to goal distance:   40
                              39
                              38
                              37
                              36
                              35
                              34
                              33
                              32
                              31
                              30
                              29
                              28
                              27
                              26
                              25
                              24
                              23
                              22
                              21
                              20
                              19
                              18
                              17
                              16
                              15
                              14
                              13
                              12
                              11
                              10
                               9
                               8
                               7
                               6
                               5
                               4
                               3
                               2
                               1
                               0

ff: found legal plan as follows
step    0: MOVE FARMBOT Z6 Z0
        1: MOUNTSOILSENSOR FARMBOT
        2: MOVE FARMBOT Z0 A1
        3: TAKEDATABEFORE FARMBOT A1
        4: MOVE FARMBOT A1 A0
        5: TAKEDATABEFORE FARMBOT A0
        6: MOVE FARMBOT A0 B0
        7: TAKEDATABEFORE FARMBOT B0
        8: MOVE FARMBOT B0 B1
        9: TAKEDATABEFORE FARMBOT B1
       10: MOVE FARMBOT B1 C0
       11: TAKEDATABEFORE FARMBOT C0
       12: MOVE FARMBOT C0 C1
       13: TAKEDATABEFORE FARMBOT C1
       14: MOVE FARMBOT C1 C2
       15: TAKEDATABEFORE FARMBOT C2
       16: MOVE FARMBOT C2 B2
       17: TAKEDATABEFORE FARMBOT B2
       18: MOVE FARMBOT B2 A2
       19: TAKEDATABEFORE FARMBOT A2
       20: MOVE FARMBOT A2 Z0
       21: DISMOUNTSOILSENSOR FARMBOT
       22: MOVE FARMBOT Z0 Z1
       23: MOUNTWATERNOZZLE FARMBOT
       24: MOVE FARMBOT Z1 A2
       25: WATERSOIL FARMBOT A2
       26: MOVE FARMBOT A2 B2
       27: WATERSOIL FARMBOT B2
       28: MOVE FARMBOT B2 C2
       29: WATERSOIL FARMBOT C2
       30: MOVE FARMBOT C2 C1
       31: WATERSOIL FARMBOT C1
       32: MOVE FARMBOT C1 C0
       33: WATERSOIL FARMBOT C0
       34: MOVE FARMBOT C0 B0
       35: WATERSOIL FARMBOT B0
       36: MOVE FARMBOT B0 A0
       37: WATERSOIL FARMBOT A0
       38: MOVE FARMBOT A0 B1
       39: WATERSOIL FARMBOT B1
       40: MOVE FARMBOT B1 A1
       41: WATERSOIL FARMBOT A1
       42: MOVE FARMBOT A1 Z1
       43: DISMOUNTWATERNOZZLE FARMBOT
       44: MOVE FARMBOT Z1 Z0
       45: MOUNTSOILSENSOR FARMBOT
       46: MOVE FARMBOT Z0 B1
       47: TAKEDATAAFTER FARMBOT B1
       48: MOVE FARMBOT B1 A1
       49: TAKEDATAAFTER FARMBOT A1
       50: MOVE FARMBOT A1 A2
       51: TAKEDATAAFTER FARMBOT A2
       52: MOVE FARMBOT A2 B0
       53: TAKEDATAAFTER FARMBOT B0
       54: MOVE FARMBOT B0 B1
       55: MOVE FARMBOT B1 B2
       56: TAKEDATAAFTER FARMBOT B2
       57: MOVE FARMBOT B2 A0
       58: TAKEDATAAFTER FARMBOT A0
       59: MOVE FARMBOT A0 C1
       60: TAKEDATAAFTER FARMBOT C1
       61: MOVE FARMBOT C1 C0
       62: TAKEDATAAFTER FARMBOT C0
       63: MOVE FARMBOT C0 C2
       64: TAKEDATAAFTER FARMBOT C2
       65: MOVE FARMBOT C2 Z0
       66: DISMOUNTSOILSENSOR FARMBOT
       67: MOVE FARMBOT Z0 Z6
plan cost: 42208.000000

time spent:    0.00 seconds instantiating 175 easy, 0 hard action templates
               0.00 seconds reachability analysis, yielding 42 facts and 175 actions
               0.00 seconds creating final representation with 42 relevant facts, 1 relevant fluents
               0.00 seconds computing LNF
               0.00 seconds building connectivity graph
               2.55 seconds searching, evaluating 74529 states, to a max depth of 0
               2.55 seconds total time

