\relax 
\providecommand\hyper@newdestlabel[2]{}
\providecommand\HyperFirstAtBeginDocument{\AtBeginDocument}
\HyperFirstAtBeginDocument{\ifx\hyper@anchor\@undefined
\global\let\oldcontentsline\contentsline
\gdef\contentsline#1#2#3#4{\oldcontentsline{#1}{#2}{#3}}
\global\let\oldnewlabel\newlabel
\gdef\newlabel#1#2{\newlabelxx{#1}#2}
\gdef\newlabelxx#1#2#3#4#5#6{\oldnewlabel{#1}{{#2}{#3}}}
\AtEndDocument{\ifx\hyper@anchor\@undefined
\let\contentsline\oldcontentsline
\let\newlabel\oldnewlabel
\fi}
\fi}
\global\let\hyper@last\relax 
\gdef\HyperFirstAtBeginDocument#1{#1}
\providecommand\HyField@AuxAddToFields[1]{}
\providecommand\HyField@AuxAddToCoFields[2]{}
\citation{fu2016establish}
\citation{kyriacou2017microgreens}
\citation{wamelink2014can}
\citation{zabel2016review}
\citation{wheeler2017agriculture}
\citation{carillo2020challenges}
\citation{ivanova2001first}
\citation{bingham2002lada}
\providecommand \oddpage@label [2]{}
\babel@aux{english}{}
\@writefile{toc}{\contentsline {section}{\numberline {1}Introduction}{1}{section.1}}
\citation{levine2016vegetable}
\citation{zabel2015introducing}
\citation{imhof2019greenhouse}
\citation{paradiso2020design}
\citation{palermo2012hydroponic}
\citation{paradiso2019growth}
\@writefile{lof}{\contentsline {figure}{\numberline {1}{\ignorespaces First space-grown salad eaten by astronauts in 2015 on the ISS.\relax }}{2}{figure.caption.1}}
\providecommand*\caption@xref[2]{\@setref\relax\@undefined{#1}}
\newlabel{salad}{{1}{2}{First space-grown salad eaten by astronauts in 2015 on the ISS.\relax }{figure.caption.1}{}}
\@writefile{toc}{\contentsline {section}{\numberline {2}Automatic vegetable growing systems}{2}{section.2}}
\citation{shani2013survey}
\bibstyle{plain}
\bibdata{mybibfile}
\bibcite{bingham2002lada}{1}
\@writefile{lof}{\contentsline {figure}{\numberline {2}{\ignorespaces Plant cultivation systems dedicated to the project: on the left, a hydroponic system designed by a team of MAE students. On the right, the \textit  {Farmbot} robotic system.\relax }}{3}{figure.caption.2}}
\newlabel{systems}{{2}{3}{Plant cultivation systems dedicated to the project: on the left, a hydroponic system designed by a team of MAE students. On the right, the \textit {Farmbot} robotic system.\relax }{figure.caption.2}{}}
\bibcite{carillo2020challenges}{2}
\bibcite{fu2016establish}{3}
\bibcite{imhof2019greenhouse}{4}
\bibcite{ivanova2001first}{5}
\bibcite{kyriacou2017microgreens}{6}
\bibcite{levine2016vegetable}{7}
\bibcite{palermo2012hydroponic}{8}
\bibcite{paradiso2019growth}{9}
\@writefile{lof}{\contentsline {figure}{\numberline {3}{\ignorespaces Partially Observable Markov Decision Process model for automatic vegetable growing system. The actions of the robot are denoted by $a_t$, streams from sensors $o_t$ and system state $s_t$. \relax }}{4}{figure.caption.3}}
\newlabel{POMDP}{{3}{4}{Partially Observable Markov Decision Process model for automatic vegetable growing system. The actions of the robot are denoted by $a_t$, streams from sensors $o_t$ and system state $s_t$. \relax }{figure.caption.3}{}}
\bibcite{paradiso2020design}{10}
\bibcite{shani2013survey}{11}
\bibcite{wamelink2014can}{12}
\bibcite{wheeler2017agriculture}{13}
\bibcite{zabel2016review}{14}
\bibcite{zabel2015introducing}{15}
