Track,Time,Hybrid Controls Used,Player,Nation,Date,Duration,Character,Vehicle,Tires,Glider
Mario Kart Stadium,1'34"277,true,しらぬい,Japan,2024-01-06,170,Light-blue Yoshi,Cat Cruiser,Cushion,Paper Glider
Water Park,1'38"995,true,Vincent,USA,2023-11-04,233,White Yoshi,Mr. Scooty,Azure Roller,Paper Glider
Sweet Sweet Canyon,1'48"030,false,Vincent,USA,2024-03-29,87,Orange Yoshi,Mr. Scooty,Azure Roller,Paper Glider
Thwomp Ruins,1'47"080,true,Panda,Australia,2024-03-10,106,Yellow Yoshi,Biddybuggy,Azure Roller,Paper Glider
Mario Circuit,1'43"723,true,Vincent,USA,2024-04-15,70,Pink Yoshi,Biddybuggy,Azure Roller,Paper Glider
Toad Harbor,2'01"498,false,なすの,Japan,2024-06-09,15,Orange Yoshi,Varmint,Azure Roller,Paper Glider
Twisted Mansion,1'53"354,true,Alberto,Spain,2023-06-20,370,Birdo (Yellow),Mr. Scooty,Azure Roller,Paper Glider
Shy Guy Falls,1'55"279,false,Yerson,Colombia,2024-03-22,94,Tanooki Mario,Teddy Buggy,Roller,Paper Glider
Sunshine Airport,1'56"971,true,Vincent,USA,2024-05-04,51,Pink Yoshi,Teddy Buggy,Azure Roller,Paper Glider
Dolphin Shoals,1'51"951,true,StervtL,Netherlands,2024-04-11,74,Pink Yoshi,Streetle,Azure Roller,Paper Glider
Electrodrome,1'55"086,true,Alberto,Spain,2024-04-26,59,White Yoshi,Biddybuggy,Azure Roller,Paper Glider
Mount Wario,1'40"545,true,F。,Japan,2024-01-07,169,Black Yoshi,Biddybuggy,Azure Roller,Paper Glider
Cloudtop Cruise,1'59"262,true,F。,Japan,2024-02-26,119,Black Yoshi,Inkstriker,Azure Roller,Paper Glider
Bone-Dry Dunes,1'46"413,true,Army,France,2024-01-06,170,Pink Yoshi,Biddybuggy,Azure Roller,Paper Glider
Bowser's Castle,1'57"655,true,Vincent,USA,2023-04-20,431,Red Yoshi,Biddybuggy,Azure Roller,Paper Glider
Rainbow Road,1'58"454,true,Alberto,Spain,2023-03-18,464,White Yoshi,Biddybuggy,Azure Roller,Paper Glider
Wii Moo Moo Meadows,1'23"642,false,Panda,Australia,2024-01-25,151,Yellow Yoshi,Biddybuggy,Azure Roller,Paper Glider
GBA Mario Circuit,1'22"930,false,もぺち,Japan,2024-05-29,26,Light-blue Yoshi,Biddybuggy,Azure Roller,Paper Glider
DS Cheep Cheep Beach,1'46"080,true,Vincent,USA,2024-01-01,175,Light-blue Yoshi,Biddybuggy,Azure Roller,Paper Glider
N64 Toad's Turnpike,1'45"563,true,Vincent,USA,2023-10-16,252,Light-blue Yoshi,Biddybuggy,Azure Roller,Paper Glider
GCN Dry Dry Desert,1'52"431,false,Army,France,2023-11-06,231,Pink Yoshi,Biddybuggy,Azure Roller,Paper Glider
SNES Donut Plains 3,1'12"833,false,Alpaco,Netherlands,2022-03-14,833,Baby Daisy,Biddybuggy,Azure Roller,Parachute
N64 Royal Raceway,1'54"778,true,Panda,Australia,2024-02-13,132,Yellow Yoshi,Teddy Buggy,Azure Roller,Paper Glider
3DS DK Jungle,2'00"477,true,k,Japan,2024-02-21,124,Yoshi,Teddy Buggy,Azure Roller,Paper Glider
DS Wario Stadium,1'49"988,true,StervtL,Netherlands,2024-03-15,101,Light-blue Yoshi,Teddy Buggy,Azure Roller,Paper Glider
GCN Sherbet Land,1'46"298,false,Alberto,Spain,2024-01-25,151,Birdo (Light Blue),Biddybuggy,Azure Roller,Paper Glider
3DS Music Park,1'50"477,false,Alberto,Spain,2024-02-24,121,Birdo (Green),Biddybuggy,Azure Roller,Paper Glider
N64 Yoshi Valley,1'57"482,false,Vincent,USA,2024-03-27,89,Pink Yoshi,Biddybuggy,Azure Roller,Paper Glider
DS Tick-Tock Clock,1'40"997,false,ありす,Japan,2024-05-07,48,Light-blue Yoshi,Biddybuggy,Roller,Flower Glider
3DS Piranha Plant Slide,1'57"960,true,Pii,Norway,2023-10-18,250,Black Yoshi,Biddybuggy,Azure Roller,Paper Glider
Wii Grumble Volcano,1'52"441,true,Panda,Australia,2023-06-16,374,Yellow Yoshi,Biddybuggy,Azure Roller,Paper Glider
N64 Rainbow Road,1'19"196,true,Vincent,USA,2024-03-17,99,Pink Yoshi,Biddybuggy,Azure Roller,Paper Glider
GCN Yoshi Circuit,1'41"253,false,Army,France,2023-06-19,371,Orange Yoshi,Mr. Scooty,Azure Roller,Paper Glider
Excitebike Arena,1'38"467,false,Army,France,2024-04-24,61,Pink Yoshi,Biddybuggy,Azure Roller,Paper Glider
Dragon Driftway,1'40"081,false,Alberto,Spain,2023-08-30,299,Teal Inkling Boy,Biddybuggy,Azure Roller,Flower Glider
Mute City,1'50"788,false,StervtL,Netherlands,2023-12-18,189,Kamek,Mach 8,Leaf Tires,Paper Glider
Wii Wario's Gold Mine,2'01"373,false,Vincent,USA,2023-08-22,307,White Yoshi,Biddybuggy,Azure Roller,Paper Glider
SNES Rainbow Road,1'25"569,false,Vincent,USA,2024-02-11,134,Light-blue Yoshi,Pipe Frame,Azure Roller,Paper Glider
Ice Ice Outpost,1'44"738,true,Alberto,Spain,2023-04-04,447,White Yoshi,Biddybuggy,Azure Roller,Paper Glider
Hyrule Circuit,1'46"905,true,エル,Japan,2023-06-16,374,Yellow Yoshi,Teddy Buggy,Azure Roller,Paper Glider
GCN Baby Park,1'01"836,false,JenZua,Spain,2023-06-15,375,Orange Yoshi,Mr. Scooty,Leaf Tires,Paper Glider
GBA Cheese Land,1'41"432,true,Army,France,2023-12-09,198,Peachette,Biddybuggy,Azure Roller,Paper Glider
Wild Woods,1'45"286,true,Alberto,Spain,2024-04-11,74,Light-blue Yoshi,Biddybuggy,Azure Roller,Paper Glider
Animal Crossing,1'35"976,true,Army,France,2023-04-06,445,Peach,Biddybuggy,Azure Roller,Paper Glider
3DS Neo Bowser City,1'42"158,true,Alberto,Spain,2023-12-12,195,White Yoshi,Biddybuggy,Azure Roller,Paper Glider
GBA Ribbon Road,1'43"489,true,Army,France,2023-08-14,315,Kamek,Teddy Buggy,Azure Roller,Paper Glider
Super Bell Subway,1'39"567,false,Yerson,Colombia,2024-05-30,25,Light-blue Yoshi,Biddybuggy,Roller,Paper Glider
Big Blue,1'23"189,true,SorNano,Japan,2024-02-12,133,Roy,Mach 8,Wood,Paper Glider
Tour Paris Promenade,1'49"376,true,Army,France,2023-06-12,378,Pink Yoshi,Teddy Buggy,Azure Roller,Paper Glider
3DS Toad Circuit,1'19"900,true,Army,France,2024-01-01,175,Kamek,Teddy Buggy,Azure Roller,Paper Glider
N64 Choco Mountain,1'51"439,true,Vincent,USA,2024-05-27,28,Pink Yoshi,Teddy Buggy,Azure Roller,Paper Glider
Wii Coconut Mall,1'40"464,true,Alberto,Spain,2024-03-24,92,White Yoshi,Cat Cruiser,Azure Roller,Paper Glider
Tour Tokyo Blur,1'25"014,true,Vincent,USA,2024-03-30,86,Pink Yoshi,Mr. Scooty,Azure Roller,Paper Glider
DS Shroom Ridge,1'44"094,true,Vincent,USA,2023-12-16,191,Pink Yoshi,Mr. Scooty,Azure Roller,Paper Glider
GBA Sky Garden,1'25"897,true,Alberto,Spain,2024-05-12,43,Yellow Yoshi,Teddy Buggy,Azure Roller,Cloud Glider
Tour Ninja Hideaway,1'51"764,true,ヒビキ,Japan,2023-10-24,244,Black Yoshi,Biddybuggy,Roller,Paper Glider
Tour New York Minute,1'22"481,false,Panda,Australia,2023-06-10,380,Yellow Yoshi,Biddybuggy,Azure Roller,Paper Glider
SNES Mario Circuit 3,1'30"525,false,Vincent,USA,2024-03-31,85,Pink Yoshi,Pipe Frame,Azure Roller,Paper Glider
N64 Kalimari Desert,1'27"642,true,Army,France,2024-03-13,103,Pink Yoshi,Biddybuggy,Azure Roller,Paper Glider
DS Waluigi Pinball,2'18"596,false,F。,Japan,2024-05-05,50,Black Yoshi,Mr. Scooty,Azure Roller,Paper Glider
Tour Sydney Sprint,1'59"382,true,Alberto,Spain,2023-05-16,405,White Yoshi,Teddy Buggy,Azure Roller,Paper Glider
GBA Snow Land,1'25"971,false,Army,France,2023-09-10,288,Pink Yoshi,Biddybuggy,Azure Roller,Paper Glider
Wii Mushroom Gorge,1'26"945,false,fairy,Japan,2023-09-02,296,Yoshi,Teddy Buggy,Azure Roller,Paper Glider
Sky-High Sundae,1'53"631,true,stove,Japan,2023-08-08,321,Yoshi,Biddybuggy,Roller,Paper Glider
Tour London Loop,2'06"799,false,¥146,Japan,2024-03-26,90,White Yoshi,Mr. Scooty,Azure Roller,Paper Glider
GBA Boo Lake,1'20"138,false,Army,France,2024-05-27,28,Pink Yoshi,Biddybuggy,Azure Roller,Paper Glider
3DS Rock Rock Mountain,2'06"997,true,Panda,Australia,2024-05-21,34,Funky Kong,Teddy Buggy,Cushion,Wario Wing
Wii Maple Treeway,2'22"565,true,L,Japan,2024-06-20,4,Tanooki Mario,Streetle,Azure Roller,Paper Glider
Tour Berlin Byways,1'55"207,true,Vincent,USA,2024-04-08,77,Pink Yoshi,Mr. Scooty,Azure Roller,Paper Glider
DS Peach Gardens,2'02"140,true,Vincent,USA,2024-06-07,17,Pink Yoshi,Biddybuggy,Azure Roller,Paper Glider
Tour Merry Mountain,1'49"453,false,Vincent,USA,2024-01-01,175,Light-blue Yoshi,Biddybuggy,Azure Roller,Paper Glider
3DS Rainbow Road,1'36"718,true,Alberto,Spain,2024-02-05,140,Light-blue Yoshi,Cat Cruiser,Azure Roller,Paper Glider
Tour Amsterdam Drift,1'34"766,true,Panda,Australia,2023-05-10,411,Yellow Yoshi,Biddybuggy,Azure Roller,Paper Glider
GBA Riverside Park,1'25"011,false,Vincent,USA,2024-05-11,44,Light-blue Yoshi,Mr. Scooty,Azure Roller,Paper Glider
Wii DK Summit,1'55"472,false,StervtL,Netherlands,2024-02-19,126,Light-blue Yoshi,Koopa Clown,Ancient Tires,Paper Glider
Yoshi's Island,1'57"052,true,YOS,Japan,2024-01-13,163,Light-blue Yoshi,Streetle,Azure Roller,Paper Glider
Tour Bangkok Rush,1'41"889,true,ささゆき,Japan,2024-01-23,153,Pink Yoshi,Mr. Scooty,Azure Roller,Paper Glider
DS Mario Circuit,1'36"957,false,Pii,Norway,2023-05-06,415,Yellow Yoshi,Biddybuggy,Azure Roller,Paper Glider
GCN Waluigi Stadium,1'53"193,false,F。,Japan,2024-04-25,60,Black Yoshi,Biddybuggy,Azure Roller,Paper Glider
Tour Singapore Speedway,1'55"666,true,ぐち,Japan,2024-06-20,4,Yoshi,Teddy Buggy,Roller,Paper Glider
Tour Athens Dash,1'37"508,true,Panda,Australia,2023-08-11,318,Yellow Yoshi,Biddybuggy,Azure Roller,Paper Glider
GCN Daisy Cruiser,1'33"951,false,Army,France,2024-01-31,145,Daisy,Biddybuggy,Azure Roller,Paper Glider
Wii Moonview Highway,1'41"918,false,Jamie,UK,2024-01-31,145,Funky Kong,Circuit Special,Slick,Super Glider
Squeaky Clean Sprint,1'59"749,true,AK,Japan,2024-04-25,60,Light-blue Yoshi,Streetle,Azure Roller,Cloud Glider
Tour Los Angeles Laps,1'45"460,true,ささゆき,Japan,2024-02-23,122,Pink Yoshi,Biddybuggy,Azure Roller,Paper Glider
GBA Sunset Wilds,1'32"261,false,¥146,Japan,2024-04-16,69,White Yoshi,Streetle,Azure Roller,Paper Glider
Wii Koopa Cape,1'56"856,false,くぜろ,Japan,2024-06-01,23,Pink Yoshi,Biddybuggy,Azure Roller,Paper Glider
Wii Koopa Cape,1'56"856,false,Alberto,Spain,2024-05-29,26,Yellow Yoshi,Biddybuggy,Azure Roller,Paper Glider
Tour Vancouver Velocity,1'59"093,true,Panda,Australia,2023-10-11,257,Yellow Yoshi,Biddybuggy,Azure Roller,Paper Glider
Tour Rome Avanti,1'43"326,true,ささゆき,Japan,2023-12-13,194,Pink Yoshi,Biddybuggy,Azure Roller,Paper Glider
GCN DK Mountain,2'08"847,false,くぜろ,Japan,2024-06-07,17,Pink Yoshi,Biddybuggy,Azure Roller,Paper Glider
Wii Daisy Circuit,1'47"664,true,Vincent,USA,2023-11-17,220,Pink Yoshi,Teddy Buggy,Azure Roller,Paper Glider
Tour Piranha Plant Cove,1'57"939,true,Bruh,USA,2024-06-06,18,Red Yoshi,Landship,Roller,Parachute
Tour Madrid Drive,1'56"142,true,Alberto,Spain,2023-11-19,218,Red Yoshi,Mr. Scooty,Azure Roller,Paper Glider
3DS Rosalina's Ice World,1'55"976,false,Alberto,Spain,2024-02-19,126,Yoshi,Streetle,Azure Roller,Paper Glider
SNES Bowser Castle 3,1'39"827,false,Pii,Norway,2023-11-30,207,Black Yoshi,Biddybuggy,Azure Roller,Cloud Glider
Wii Rainbow Road,2'31"599,false,k,Japan,2023-12-29,178,Wario,Mach 8,Slim,Cloud Glider
